,�����ʁi��t�j,�L�����ʁi��t�j,�r�o�ʁi��t�j,���Ȓ��ԏ����ʁi��t�j,���Ȓ��ԏ����ʁi���A���Ȓ��ԏ�����ʁj�i��t�j,���Ȓ��ԏ����ʁi���A���Ȓ��ԏ�����ʓ��A���Ȓ��ԏ�����Đ����p�ʁj�i��t�j,���Ȓ��ԏ����ʁi���A���Ȓ��ԏ�����ʓ��A���Ȓ��ԏ����㎩�ȍŏI�����ʁj�i��t�j,���Ȓ��ԏ����ʁi���A���Ȓ��ԏ�����ʓ��A���Ȓ��ԏ�����ϑ������ʁj�i��t�j,���Ȓ��ԏ����ʁi���A���Ȓ��ԏ�����ʓ��A���Ȓ��ԏ�����ϑ����ڍŏI�����ʁj�i��t�j,���Ȍ��ʉ��ʁi��t�j,���Ȗ������ʁi��t�j,���Ȗ������ʁi���A���Ȗ������Đ����p�ʁj�i��t�j,���Ȗ������ʁi���A���Ȗ��������ȍŏI�����ʁj�i��t�j,���Ȗ������ʁi���A���Ȗ������ϑ������ʁj�i��t�j,���Ȗ������ʁi���A���Ȗ������ϑ����ڍŏI�����ʁj�i��t�j,�ϑ������ʁi��t�j,�ϑ������ʁi���A�ϑ����ԏ����ʁj�i��t�j,�ϑ������ʁi���A�ϑ����ԏ����ʓ��A�ϑ����ԏ�����ʁj�i��t�j,�ϑ������ʁi���A�ϑ����ԏ����ʓ��A�ϑ����ԏ�����Đ����p�ʁj�i��t�j,�ϑ������ʁi���A�ϑ����ԏ����ʓ��A�ϑ����ԏ�����ŏI�����ʁj�i��t�j,�ϑ������ʁi���A�ϑ����ڍŏI�����ʁj�i��t�j,�ϑ����ʉ��ʁi��t�j,�ϑ��ŏI�����ʁi��t�j,�Đ����p�ʁi��t�j,���ʉ��ʁi��t�j,�ŏI�����ʁi��t�j,
���v,13538,1,13538,13527,112,,62,28,23,13415,10,0,,10,0,61,38,17,12,4,23,22,27,12,13437,89,
�R���k,2,0,2,,,,,,,,2,,,2,,2,2,2,2,,,,,2,,,
���D,13536,1,13535,13527,112,,62,28,23,13415,8,0,,8,0,59,36,14,10,4,23,22,27,10,13437,89,
���D�i���A�㐅���D�j,469,1,468,467,43,,,21,23,423,2,0,,2,,45,22,5,2,3,23,17,26,2,441,26,
���D�i���A�������D�j,13066,,13066,13061,69,,62,7,,12992,5,,,5,0,13,13,9,8,1,0,4,1,8,12995,62,
���D�i���A���݉��D�j,,,,,,,,,,,,,,,,,,,,,,,,,,,
���D�i���A���̑��̉��D�j,1,,1,,,,,,,,1,,,1,0,1,1,0,0,0,0,1,0,0,1,0,
�p��,0,,0,,,,,,,,0,,,0,,0,0,0,0,0,,0,0,0,0,0,
�p�_,0,,0,,,,,,,,0,,,0,,0,0,0,0,0,,0,0,0,0,0,
�p�A���J��,0,,0,,,,,,,,0,,,0,,0,0,0,,0,,0,0,,0,0,
�p�v���X�`�b�N��,0,,0,,,,,,,,0,,,0,,0,0,0,0,0,,0,0,0,0,0,
�S������,,,,,,,,,,,,,,,,,,,,,,,,,,,
��������,0,0,,,,,,,,,,,,,,,,,,,,,,,,,
�K���X�E�����킭��,0,,0,,,,,,,,0,,,0,,0,0,0,,0,,,0,,,0,
�z����,,,,,,,,,,,,,,,,,,,,,,,,,,,
���ꂫ,0,,0,,,,,,,,0,,,0,,0,0,0,0,,,,,0,,,
���ꂫ�i���A�R���N���[�g��j,0,,0,,,,,,,,0,,,0,,0,0,0,0,,,,,0,,,
���ꂫ�i���A�A �X �t  �@ ��  �g  �  �R  ��  �N  �� �[  �g  ��j,0,,0,,,,,,,,0,,,0,,0,0,0,0,,,,,0,,,
���ꂫ�i���A���̑��̂��ꂫ�ށj,,,,,,,,,,,,,,,,,,,,,,,,,,,
�ΖȊܗL�Y�Ɣj����,,,,,,,,,,,,,,,,,,,,,,,,,,,
�΂�����,0,,0,,,,,,,,0,,,0,,0,0,0,,0,,,0,,,0,
������,,,,,,,,,,,,,,,,,,,,,,,,,,,
�؂���,,,,,,,,,,,,,,,,,,,,,,,,,,,
�@�ۂ���,,,,,,,,,,,,,,,,,,,,,,,,,,,
���A�����c��,,,,,,,,,,,,,,,,,,,,,,,,,,,
�����n�Ō`�s�v��,,,,,,,,,,,,,,,,,,,,,,,,,,,
�����̂ӂ�A,,,,,,,,,,,,,,,,,,,,,,,,,,,
�����̎���,,,,,,,,,,,,,,,,,,,,,,,,,,,
����13����,,,,,,,,,,,,,,,,,,,,,,,,,,,
�����p����,0,,0,,,,,,,,0,,,0,,0,0,0,0,0,,,0,0,,0,
���̑�,0,,0,,,,,,,,0,,,0,,0,0,0,0,0,,,0,0,,0,
���ʊǗ��Y�Ɣp����,0,,0,,,,,,,,0,,,0,,0,0,0,0,0,,0,0,0,0,0,
�p��,0,,0,,,,,,,,0,,,0,,0,0,0,0,0,,0,0,0,0,0,
�p�_,0,,0,,,,,,,,0,,,0,,0,0,0,,0,,0,0,,0,0,
�p�A���J��,0,,0,,,,,,,,0,,,0,,0,0,0,,0,,0,0,,0,0,
�������p����,,,,,,,,,,,,,,,,,,,,,,,,,,,
����L�Q�p����,0,,0,,,,,,,,0,,,0,,0,0,0,,0,,0,0,,0,0,
����L�Q�p�����i���A�pPCB���j,0,,0,,,,,,,,0,,,,,0,0,0,,0,,,0,,,0,
����L�Q�p�����i���A�p�Ζȓ��j,,,,,,,,,,,,,,,,,,,,,,,,,,,
����L�Q�p�����i���A���̑��́j,0,,0,,,,,,,,0,,,0,,0,0,0,,0,,0,0,,0,0,
����L�Q�p�����i���A���̑��̎w �� �� �� �� �� �D�j,,,,,,,,,,,,,,,,,,,,,,,,,,,
����L�Q�p�����i���A���̑��̍z �� ���j,,,,,,,,,,,,,,,,,,,,,,,,,,,
����L�Q�p�����i���A���̑��̔R �� �k�j,,,,,,,,,,,,,,,,,,,,,,,,,,,
����L�Q�p�����i���A���̑��̂� �� �� ��j,,,,,,,,,,,,,,,,,,,,,,,,,,,
����L�Q�p�����i���A���̑��̔p ���j,,,,,,,,,,,,,,,,,,,,,,,,,,,
����L�Q�p�����i���A���̑��̉��D�j,,,,,,,,,,,,,,,,,,,,,,,,,,,
����L�Q�p�����i���A���̑��̔p�_�j,0,,0,,,,,,,,0,,,0,,0,0,0,,0,,0,0,,0,0,
����L�Q�p�����i���A���̑��̔p�A���J���j,0,,0,,,,,,,,0,,,0,,0,0,0,,0,,0,0,,0,0,
