������,���v�i��t�j,�R���k�i��t�j,���D�i��t�j,���D�i���A�㐅���D�j�i��t�j,���D�i���A�������D�j�i��t�j,���D�i���A���݉��D�j�i��t�j,���D�i���A���̑��̉��D�j�i��t�j,�p���i��t�j,�p�_�i��t�j,�p�A���J���i��t�j,�p�v���X�`�b�N�ށi��t�j,�S�������i��t�j,���������i��t�j,�K���X�E�����킭���i��t�j,�z�����i��t�j,���ꂫ�ށi��t�j,���ꂫ�ށi���A�R���N���[�g��j�i��t�j,���ꂫ�ށi���A�A�X�t�@���g��R���N���[�g��j�i��t�j,���ꂫ�ށi���A���̑��̂��ꂫ�ށj�i��t�j,�ΖȊܗL�Y�Ɣp�����i��t�j,�΂�����i��t�j,�������i��t�j,�؂����i��t�j,�@�ۂ����i��t�j,���A�����c���i��t�j,�����n�Ō`�s�v���i��t�j,�����̂ӂ�A�i��t�j,�����̎��́i��t�j,����13�����i��t�j,�����p�����i��t�j,���̑��i��t�j,,������,���ʊǗ��Y�Ɣp�����i��t�j,���ʊǗ��Y�Ɣp�����i���A�p���j�i��t�j,���ʊǗ��Y�Ɣp�����i���A�p�_�j�i��t�j,���ʊǗ��Y�Ɣp�����i���A�p�A���J���j�i��t�j,���ʊǗ��Y�Ɣp�����i���A�������p�����j�i��t�j,���ʊǗ��Y�Ɣp�����i���A����L�Q�p�����j�i��t�j,���ʊǗ��Y�Ɣp�����i���A����L�Q�p�������A�p�o�b�a���j�i��t�j,���ʊǗ��Y�Ɣp�����i���A����L�Q�p�������A�p�Ζȓ��j�i��t�j,���ʊǗ��Y�Ɣp�����i���A����L�Q�p�������A���̑��j�i��t�j,���ʊǗ��Y�Ɣp�����i���A����L�Q�p�������A���̑����A�w�艺�������D�j�i��t�j,���ʊǗ��Y�Ɣp�����i���A����L�Q�p�������A���̑����A�z�����j�i��t�j,���ʊǗ��Y�Ɣp�����i���A����L�Q�p�������A���̑����A�R���k�j�i��t�j,���ʊǗ��Y�Ɣp�����i���A����L�Q�p�������A���̑����A�΂�����j�i��t�j,���ʊǗ��Y�Ɣp�����i���A����L�Q�p�������A���̑����A�p���j�i��t�j,���ʊǗ��Y�Ɣp�����i���A����L�Q�p�������A���̑����A���D�j�i��t�j,���ʊǗ��Y�Ɣp�����i���A����L�Q�p�������A���̑����A�p�_�j�i��t�j,���ʊǗ��Y�Ɣp�����i���A����L�Q�p�������A���̑����A�p�A���J���j�i��t�j,,
���v,1226,0,434,,,,434,15,32,27,79,0,24,412,41,36,24,12,0,0,4,18,19,0,48,,,,,1,0,,���v,34,2,20,2,0,10,0,0,10,0,,,7,1,0,0,2,,
�k�C��,0,,0,,,,0,,0,,,,0,0,,,,,,,,,,,,,,,,,0,,�k�C��,0,,,,,0,,,0,,,,,,0,,,,
�X��,2,,,,,,,,,,,,,,,,,,,,,2,,,,,,,,,,,�X��,,,,,,,,,,,,,,,,,,,
��茧,0,,,,,,,,,,0,,,,,,,,,,,,,,,,,,,,,,��茧,,,,,,,,,,,,,,,,,,,
�{�錧,0,,0,,,,0,,,,,,,,,,,,,,,,,,,,,,,,,,�{�錧,0,0,,,,,,,,,,,,,,,,,
�H�c��,,,,,,,,,,,,,,,,,,,,,,,,,,,,,,,,,�H�c��,,,,,,,,,,,,,,,,,,,
�R�`��,,,,,,,,,,,,,,,,,,,,,,,,,,,,,,,,,�R�`��,,,,,,,,,,,,,,,,,,,
������,10,,0,,,,0,0,0,0,0,,,0,,,,,,,3,,,,,,,,,,,,������,6,0,0,0,,6,0,,6,,,,6,,0,,,,
��錧,10,,4,,,,4,1,0,0,1,,0,0,1,,,,,0,,,,,1,,,,,,,,��錧,1,0,0,,,0,,0,0,,,,0,0,,,,,
�Ȗ،�,122,,7,,,,7,2,0,1,0,,0,110,,0,0,,,,,,,,2,,,,,,0,,�Ȗ،�,1,1,0,,,,,,,,,,,,,,,,
�Q�n��,25,,4,,,,4,0,0,0,3,,0,13,,,,,,,,0,0,,4,,,,,0,0,,�Q�n��,0,0,0,,,0,,,0,,,,,0,0,,,,
��ʌ�,127,,20,,,,20,2,12,3,26,,5,2,30,3,3,0,0,,,2,3,0,11,,,,,1,0,,��ʌ�,5,0,3,1,,1,0,,1,,,,,0,0,0,1,,
��t��,61,,2,,,,2,2,1,0,3,,0,12,9,12,4,8,,,1,1,1,,16,,,,,0,0,,��t��,1,0,,,0,0,0,,0,0,,,,0,0,,0,,
�����s,762,0,388,,,,388,7,3,2,41,0,17,237,1,20,16,4,0,0,0,13,14,0,7,,,,,0,0,,�����s,14,0,13,1,0,0,0,0,0,0,,,,0,0,0,0,,
�_�ސ쌧,85,0,7,,,,7,1,11,16,4,,1,37,0,0,0,,0,,,0,1,,5,,,,,0,0,,�_�ސ쌧,1,0,1,0,0,0,,,0,0,,,0,0,0,0,0,,
�V����,1,,0,,,,0,,0,0,0,,0,0,,0,,,0,,,,,,,,,,,,,,�V����,0,,0,,,0,,,0,,,,,,0,0,0,,
�x�R��,2,,1,,,,1,0,1,,0,,,0,,,,,,,,,,,,,,,,,,,�x�R��,0,,,,,0,0,,0,,,,,,0,0,0,,
�ΐ쌧,0,,,,,,,,,,0,,,,,,,,,,,,,,,,,,,,,,�ΐ쌧,,,,,,,,,,,,,,,,,,,
���䌧,0,,,,,,,0,,,,,,0,,,,,,,,,,,,,,,,,,,���䌧,,,,,,,,,,,,,,,,,,,
�R����,3,,,,,,,,,,0,,0,1,,,,,,,,,0,,1,,,,,,,,�R����,,,,,,,,,,,,,,,,,,,
���쌧,6,,0,,,,0,0,0,5,0,,,0,,,,,,,,,0,,,,,,,,,,���쌧,0,0,,,,0,,,0,,,,,,0,0,0,,
�򕌌�,,,,,,,,,,,,,,,,,,,,,,,,,,,,,,,,,�򕌌�,,,,,,,,,,,,,,,,,,,
�É���,1,,,,,,,,,,,,0,,,,,,,,,1,,,,,,,,,,,�É���,,,,,,,,,,,,,,,,,,,
���m��,0,,,,,,,0,,0,0,,0,,,,,,,,,,,,,,,,,,,,���m��,0,0,,,,0,0,,,,,,,,,,,,
�O�d��,0,,,,,,,0,0,,,,,,,,,,,,,,,,,,,,,,,,�O�d��,,,,,,,,,,,,,,,,,,,
���ꌧ,,,,,,,,,,,,,,,,,,,,,,,,,,,,,,,,,���ꌧ,,,,,,,,,,,,,,,,,,,
���s�{,,,,,,,,,,,,,,,,,,,,,,,,,,,,,,,,,���s�{,,,,,,,,,,,,,,,,,,,
���{,0,,,,,,,0,,,,,,,,,,,,,,,,,,,,,,,,,���{,,,,,,,,,,,,,,,,,,,
���Ɍ�,8,,0,,,,0,0,3,0,1,,,,,,,,,,,,,,,,,,,,,,���Ɍ�,4,0,3,0,,1,,,1,,,,,1,,0,0,,
�ޗǌ�,0,,,,,,,,,0,,,,,,,,,,,,,,,,,,,,,,,�ޗǌ�,,,,,,,,,,,,,,,,,,,
�a�̎R��,,,,,,,,,,,,,,,,,,,,,,,,,,,,,,,,,�a�̎R��,,,,,,,,,,,,,,,,,,,
���挧,0,,0,,,,0,0,,,,,,,,,,,,,,,,,,,,,,,,,���挧,0,,,,0,,,,,,,,,,,,,,
������,,,,,,,,,,,,,,,,,,,,,,,,,,,,,,,,,������,,,,,,,,,,,,,,,,,,,
���R��,0,,,,,,,,,,,,,,,,,,,,,,,,,,,,,,,,���R��,0,,,,,0,0,,,,,,,,,,,,
�L����,1,,0,,,,0,0,0,,0,,,,,,,,,,,,,,,,,,,,,,�L����,0,0,,,,0,,,0,,,,,,0,,,,
�R����,0,,,,,,,,,,,,0,0,,,,,,,,,,,,,,,,,,,�R����,,,,,,,,,,,,,,,,,,,
������,0,,,,,,,0,0,0,,,,,,,,,,,,,,,,,,,,,,,������,0,,0,0,,0,,,0,0,,,,,,,,,
���쌧,0,,,,,,,,,,0,,0,0,,,,,,,,,0,,,,,,,,,,���쌧,,,,,,,,,,,,,,,,,,,
���Q��,,,,,,,,,,,,,,,,,,,,,,,,,,,,,,,,,���Q��,,,,,,,,,,,,,,,,,,,
���m��,,,,,,,,,,,,,,,,,,,,,,,,,,,,,,,,,���m��,,,,,,,,,,,,,,,,,,,
������,0,,0,,,,0,0,0,0,,,,,,,,,,,,,,,,,,,,,,,������,0,0,,,,0,,,0,,,,,0,0,0,,,
���ꌧ,,,,,,,,,,,,,,,,,,,,,,,,,,,,,,,,,���ꌧ,,,,,,,,,,,,,,,,,,,
���茧,,,,,,,,,,,,,,,,,,,,,,,,,,,,,,,,,���茧,,,,,,,,,,,,,,,,,,,
�F�{��,,,,,,,,,,,,,,,,,,,,,,,,,,,,,,,,,�F�{��,,,,,,,,,,,,,,,,,,,
�啪��,0,,0,,,,0,0,,,,,,,,,,,,,,,,,,,,,,,,,�啪��,0,,,,,0,,,0,,,,,,0,,,,
�{�茧,,,,,,,,,,,,,,,,,,,,,,,,,,,,,,,,,�{�茧,,,,,,,,,,,,,,,,,,,
��������,,,,,,,,,,,,,,,,,,,,,,,,,,,,,,,,,��������,,,,,,,,,,,,,,,,,,,
���ꌧ,,,,,,,,,,,,,,,,,,,,,,,,,,,,,,,,,���ꌧ,,,,,,,,,,,,,,,,,,,
�k�C��,0,,0,,,,0,,0,,,,0,0,,,,,,,,,,,,,,,,,0,,�k�C��,0,,,,,0,,,0,,,,,,0,,,,
���k,12,,0,,,,0,0,0,0,1,,,0,,,,,,,3,2,,,,,,,,,,,���k,6,0,0,0,,6,0,,6,,,,6,,0,,,,
�֓�,1193,0,432,,,,432,15,28,22,78,0,24,411,41,36,24,12,0,0,1,16,19,0,47,,,,,1,0,,�֓�,23,2,16,2,0,2,0,0,2,0,,,0,0,0,0,2,,
�b�M�z,11,,2,,,,2,0,1,5,0,,0,1,,0,,,0,,,,0,,1,,,,,,,,�b�M�z,1,0,0,,,1,0,,1,,,,,,0,0,0,,
���C�E����,1,,,,,,,0,0,0,0,,0,,,,,,,,,1,,,,,,,,,,,���C�E����,0,0,,,,0,0,,,,,,,,,,,,
�ߋE,8,,0,,,,0,0,3,0,1,,,,,,,,,,,,,,,,,,,,,,�ߋE,4,0,3,0,,1,,,1,,,,,1,,0,0,,
�����E�l��,1,,0,,,,0,0,0,0,0,,0,0,,,,,,,,,0,,,,,,,,,,�����E�l��,0,0,0,0,0,0,0,,0,0,,,,,0,,,,
��B�E����,0,,0,,,,0,0,0,0,,,,,,,,,,,,,,,,,,,,,,,��B�E����,0,0,,,,0,,,0,,,,,0,0,0,,,
,,,,,,,,,,,,,,,,,,,,,,,,,,,,,,,,,,,,,,,,,,,,,,,,,,,,
,,,,,,,,,,,,,,,,,,,,,,,,,,,,,,,,,,,,,,,,,,,,,,,,,,,,
,,0,,,,,30,1,1,0,4,,1,59,,,6,,0,,2,0,3,,12,,,,,0,,,,,0,1,0,,,,0,,,,,0,0,0,0,0,,
