������,���v�i��t�j,�R���k�i��t�j,���D�i��t�j,���D�i���A�㐅���D�j�i��t�j,���D�i���A�������D�j�i��t�j,���D�i���A���݉��D�j�i��t�j,���D�i���A���̑��̉��D�j�i��t�j,�p���i��t�j,�p�_�i��t�j,�p�A���J���i��t�j,�p�v���X�`�b�N�ށi��t�j,�S�������i��t�j,���������i��t�j,�K���X�E�����킭���i��t�j,�z�����i��t�j,���ꂫ�ށi��t�j,���ꂫ�ށi���A�R���N���[�g��j�i��t�j,���ꂫ�ށi���A�A�X�t�@���g��R���N���[�g��j�i��t�j,���ꂫ�ށi���A���̑��̂��ꂫ�ށj�i��t�j,�ΖȊܗL�Y�Ɣp�����i��t�j,�΂�����i��t�j,�������i��t�j,�؂����i��t�j,�@�ۂ����i��t�j,���A�����c���i��t�j,�����n�Ō`�s�v���i��t�j,�����̂ӂ�A�i��t�j,�����̎��́i��t�j,����13�����i��t�j,�����p�����i��t�j,���̑��i��t�j,,������,���ʊǗ��Y�Ɣp�����i��t�j,���ʊǗ��Y�Ɣp�����i���A�p���j�i��t�j,���ʊǗ��Y�Ɣp�����i���A�p�_�j�i��t�j,���ʊǗ��Y�Ɣp�����i���A�p�A���J���j�i��t�j,���ʊǗ��Y�Ɣp�����i���A�������p�����j�i��t�j,���ʊǗ��Y�Ɣp�����i���A����L�Q�p�����j�i��t�j,���ʊǗ��Y�Ɣp�����i���A����L�Q�p�������A�p�o�b�a���j�i��t�j,���ʊǗ��Y�Ɣp�����i���A����L�Q�p�������A�p�Ζȓ��j�i��t�j,���ʊǗ��Y�Ɣp�����i���A����L�Q�p�������A���̑��j�i��t�j,���ʊǗ��Y�Ɣp�����i���A����L�Q�p�������A���̑����A�w�艺�������D�j�i��t�j,���ʊǗ��Y�Ɣp�����i���A����L�Q�p�������A���̑����A�z�����j�i��t�j,���ʊǗ��Y�Ɣp�����i���A����L�Q�p�������A���̑����A�R���k�j�i��t�j,���ʊǗ��Y�Ɣp�����i���A����L�Q�p�������A���̑����A�΂�����j�i��t�j,���ʊǗ��Y�Ɣp�����i���A����L�Q�p�������A���̑����A�p���j�i��t�j,���ʊǗ��Y�Ɣp�����i���A����L�Q�p�������A���̑����A���D�j�i��t�j,���ʊǗ��Y�Ɣp�����i���A����L�Q�p�������A���̑����A�p�_�j�i��t�j,���ʊǗ��Y�Ɣp�����i���A����L�Q�p�������A���̑����A�p�A���J���j�i��t�j,,
���v,13538,2,13535,468,13066,,1,0,0,0,0,,,0,,0,0,0,,,0,,,,,,,,,0,0,,���v,0,0,0,0,,0,0,,0,,,,,,,0,0,,
�k�C��,,,,,,,,,,,,,,,,,,,,,,,,,,,,,,,,,�k�C��,,,,,,,,,,,,,,,,,,,
�X��,,,,,,,,,,,,,,,,,,,,,,,,,,,,,,,,,�X��,,,,,,,,,,,,,,,,,,,
��茧,,,,,,,,,,,,,,,,,,,,,,,,,,,,,,,,,��茧,,,,,,,,,,,,,,,,,,,
�{�錧,,,,,,,,,,,,,,,,,,,,,,,,,,,,,,,,,�{�錧,,,,,,,,,,,,,,,,,,,
�H�c��,,,,,,,,,,,,,,,,,,,,,,,,,,,,,,,,,�H�c��,,,,,,,,,,,,,,,,,,,
�R�`��,,,,,,,,,,,,,,,,,,,,,,,,,,,,,,,,,�R�`��,,,,,,,,,,,,,,,,,,,
������,,,,,,,,,,,,,,,,,,,,,,,,,,,,,,,,,������,,,,,,,,,,,,,,,,,,,
��錧,,,,,,,,,,,,,,,,,,,,,,,,,,,,,,,,,��錧,,,,,,,,,,,,,,,,,,,
�Ȗ،�,2,,2,,2,,,,,,,,,,,,,,,,,,,,,,,,,,,,�Ȗ،�,,,,,,,,,,,,,,,,,,,
�Q�n��,,,,,,,,,,,,,,,,,,,,,,,,,,,,,,,,,�Q�n��,,,,,,,,,,,,,,,,,,,
��ʌ�,5,2,3,,3,,0,0,,,0,,,,,0,0,,,,,,,,,,,,,0,,,��ʌ�,0,0,,,,0,,,0,,,,,,,0,,,
��t��,0,,,,,,,0,,,,,,,,,,,,,,,,,,,,,,,,,��t��,,,,,,,,,,,,,,,,,,,
�����s,13530,,13530,468,13061,,1,0,,,0,,,0,,0,0,0,,,,,,,,,,,,0,0,,�����s,0,,,,,0,0,,,,,,,,,,,,
�_�ސ쌧,0,0,0,,0,,,0,,,,,,,,,,,,,0,,,,,,,,,,0,,�_�ސ쌧,0,0,0,0,,,,,,,,,,,,,,,
�V����,,,,,,,,,,,,,,,,,,,,,,,,,,,,,,,,,�V����,,,,,,,,,,,,,,,,,,,
�x�R��,,,,,,,,,,,,,,,,,,,,,,,,,,,,,,,,,�x�R��,,,,,,,,,,,,,,,,,,,
�ΐ쌧,,,,,,,,,,,,,,,,,,,,,,,,,,,,,,,,,�ΐ쌧,,,,,,,,,,,,,,,,,,,
���䌧,,,,,,,,,,,,,,,,,,,,,,,,,,,,,,,,,���䌧,,,,,,,,,,,,,,,,,,,
�R����,1,,1,,1,,,,,,,,,,,,,,,,,,,,,,,,,,,,�R����,,,,,,,,,,,,,,,,,,,
���쌧,,,,,,,,,,,,,,,,,,,,,,,,,,,,,,,,,���쌧,,,,,,,,,,,,,,,,,,,
�򕌌�,,,,,,,,,,,,,,,,,,,,,,,,,,,,,,,,,�򕌌�,,,,,,,,,,,,,,,,,,,
�É���,,,,,,,,,,,,,,,,,,,,,,,,,,,,,,,,,�É���,,,,,,,,,,,,,,,,,,,
���m��,,,,,,,,,,,,,,,,,,,,,,,,,,,,,,,,,���m��,,,,,,,,,,,,,,,,,,,
�O�d��,,,,,,,,,,,,,,,,,,,,,,,,,,,,,,,,,�O�d��,,,,,,,,,,,,,,,,,,,
���ꌧ,,,,,,,,,,,,,,,,,,,,,,,,,,,,,,,,,���ꌧ,,,,,,,,,,,,,,,,,,,
���s�{,,,,,,,,,,,,,,,,,,,,,,,,,,,,,,,,,���s�{,,,,,,,,,,,,,,,,,,,
���{,,,,,,,,,,,,,,,,,,,,,,,,,,,,,,,,,���{,,,,,,,,,,,,,,,,,,,
���Ɍ�,0,,,,,,,,0,0,,,,,,,,,,,,,,,,,,,,,,,���Ɍ�,0,,,,,0,,,0,,,,,,,0,0,,
�ޗǌ�,,,,,,,,,,,,,,,,,,,,,,,,,,,,,,,,,�ޗǌ�,,,,,,,,,,,,,,,,,,,
�a�̎R��,,,,,,,,,,,,,,,,,,,,,,,,,,,,,,,,,�a�̎R��,,,,,,,,,,,,,,,,,,,
���挧,,,,,,,,,,,,,,,,,,,,,,,,,,,,,,,,,���挧,,,,,,,,,,,,,,,,,,,
������,,,,,,,,,,,,,,,,,,,,,,,,,,,,,,,,,������,,,,,,,,,,,,,,,,,,,
���R��,,,,,,,,,,,,,,,,,,,,,,,,,,,,,,,,,���R��,,,,,,,,,,,,,,,,,,,
�L����,,,,,,,,,,,,,,,,,,,,,,,,,,,,,,,,,�L����,,,,,,,,,,,,,,,,,,,
�R����,,,,,,,,,,,,,,,,,,,,,,,,,,,,,,,,,�R����,,,,,,,,,,,,,,,,,,,
������,,,,,,,,,,,,,,,,,,,,,,,,,,,,,,,,,������,,,,,,,,,,,,,,,,,,,
���쌧,,,,,,,,,,,,,,,,,,,,,,,,,,,,,,,,,���쌧,,,,,,,,,,,,,,,,,,,
���Q��,,,,,,,,,,,,,,,,,,,,,,,,,,,,,,,,,���Q��,,,,,,,,,,,,,,,,,,,
���m��,,,,,,,,,,,,,,,,,,,,,,,,,,,,,,,,,���m��,,,,,,,,,,,,,,,,,,,
������,0,,0,0,,,0,0,0,,,,,0,,,,,,,,,,,,,,,,,,,������,0,0,0,,,0,,,0,,,,,,,0,,,
���ꌧ,,,,,,,,,,,,,,,,,,,,,,,,,,,,,,,,,���ꌧ,,,,,,,,,,,,,,,,,,,
���茧,,,,,,,,,,,,,,,,,,,,,,,,,,,,,,,,,���茧,,,,,,,,,,,,,,,,,,,
�F�{��,,,,,,,,,,,,,,,,,,,,,,,,,,,,,,,,,�F�{��,,,,,,,,,,,,,,,,,,,
�啪��,,,,,,,,,,,,,,,,,,,,,,,,,,,,,,,,,�啪��,,,,,,,,,,,,,,,,,,,
�{�茧,,,,,,,,,,,,,,,,,,,,,,,,,,,,,,,,,�{�茧,,,,,,,,,,,,,,,,,,,
��������,,,,,,,,,,,,,,,,,,,,,,,,,,,,,,,,,��������,,,,,,,,,,,,,,,,,,,
���ꌧ,,,,,,,,,,,,,,,,,,,,,,,,,,,,,,,,,���ꌧ,,,,,,,,,,,,,,,,,,,
�k�C��,,,,,,,,,,,,,,,,,,,,,,,,,,,,,,,,,�k�C��,,,,,,,,,,,,,,,,,,,
���k,,,,,,,,,,,,,,,,,,,,,,,,,,,,,,,,,���k,,,,,,,,,,,,,,,,,,,
�֓�,13537,2,13535,468,13065,,1,0,,,0,,,0,,0,0,0,,,0,,,,,,,,,0,0,,�֓�,0,0,0,0,,0,0,,0,,,,,,,0,,,
�b�M�z,1,,1,,1,,,,,,,,,,,,,,,,,,,,,,,,,,,,�b�M�z,,,,,,,,,,,,,,,,,,,
���C�E����,,,,,,,,,,,,,,,,,,,,,,,,,,,,,,,,,���C�E����,,,,,,,,,,,,,,,,,,,
�ߋE,0,,,,,,,,0,0,,,,,,,,,,,,,,,,,,,,,,,�ߋE,0,,,,,0,,,0,,,,,,,0,0,,
�����E�l��,,,,,,,,,,,,,,,,,,,,,,,,,,,,,,,,,�����E�l��,,,,,,,,,,,,,,,,,,,
��B�E����,0,,0,0,,,0,0,0,,,,,0,,,,,,,,,,,,,,,,,,,��B�E����,0,0,0,,,0,,,0,,,,,,,0,,,
