������,���v�i��t�j,�R���k�i��t�j,���D�i��t�j,���D�i���A�㐅���D�j�i��t�j,���D�i���A�������D�j�i��t�j,���D�i���A���݉��D�j�i��t�j,���D�i���A���̑��̉��D�j�i��t�j,�p���i��t�j,�p�_�i��t�j,�p�A���J���i��t�j,�p�v���X�`�b�N�ށi��t�j,�S�������i��t�j,���������i��t�j,�K���X�E�����킭���i��t�j,�z�����i��t�j,���ꂫ�ށi��t�j,���ꂫ�ށi���A�R���N���[�g��j�i��t�j,���ꂫ�ށi���A�A�X�t�@���g��R���N���[�g��j�i��t�j,���ꂫ�ށi���A���̑��̂��ꂫ�ށj�i��t�j,�ΖȊܗL�Y�Ɣp�����i��t�j,�΂�����i��t�j,�������i��t�j,�؂����i��t�j,�@�ۂ����i��t�j,���A�����c���i��t�j,�����n�Ō`�s�v���i��t�j,�����̂ӂ�A�i��t�j,�����̎��́i��t�j,����13�����i��t�j,�����p�����i��t�j,���̑��i��t�j,,������,���ʊǗ��Y�Ɣp�����i��t�j,���ʊǗ��Y�Ɣp�����i���A�p���j�i��t�j,���ʊǗ��Y�Ɣp�����i���A�p�_�j�i��t�j,���ʊǗ��Y�Ɣp�����i���A�p�A���J���j�i��t�j,���ʊǗ��Y�Ɣp�����i���A�������p�����j�i��t�j,���ʊǗ��Y�Ɣp�����i���A����L�Q�p�����j�i��t�j,���ʊǗ��Y�Ɣp�����i���A����L�Q�p�������A�p�o�b�a���j�i��t�j,���ʊǗ��Y�Ɣp�����i���A����L�Q�p�������A�p�Ζȓ��j�i��t�j,���ʊǗ��Y�Ɣp�����i���A����L�Q�p�������A���̑��j�i��t�j,���ʊǗ��Y�Ɣp�����i���A����L�Q�p�������A���̑����A�w�艺�������D�j�i��t�j,���ʊǗ��Y�Ɣp�����i���A����L�Q�p�������A���̑����A�z�����j�i��t�j,���ʊǗ��Y�Ɣp�����i���A����L�Q�p�������A���̑����A�R���k�j�i��t�j,���ʊǗ��Y�Ɣp�����i���A����L�Q�p�������A���̑����A�΂�����j�i��t�j,���ʊǗ��Y�Ɣp�����i���A����L�Q�p�������A���̑����A�p���j�i��t�j,���ʊǗ��Y�Ɣp�����i���A����L�Q�p�������A���̑����A���D�j�i��t�j,���ʊǗ��Y�Ɣp�����i���A����L�Q�p�������A���̑����A�p�_�j�i��t�j,���ʊǗ��Y�Ɣp�����i���A����L�Q�p�������A���̑����A�p�A���J���j�i��t�j,,
���v,105,0,8,,,,8,4,0,0,54,0,8,4,0,3,2,,0,,,,19,,,,,,,2,2,,���v,1,1,0,0,0,0,0,,0,0,,,,0,0,0,,,
�k�C��,0,,,,,,,,,,,,0,0,,,,,,,,,,,,,,,,,,,�k�C��,,,,,,,,,,,,,,,,,,,
�X��,,,,,,,,,,,,,,,,,,,,,,,,,,,,,,,,,�X��,,,,,,,,,,,,,,,,,,,
��茧,,,,,,,,,,,,,,,,,,,,,,,,,,,,,,,,,��茧,,,,,,,,,,,,,,,,,,,
�{�錧,,,,,,,,,,,,,,,,,,,,,,,,,,,,,,,,,�{�錧,,,,,,,,,,,,,,,,,,,
�H�c��,,,,,,,,,,,,,,,,,,,,,,,,,,,,,,,,,�H�c��,,,,,,,,,,,,,,,,,,,
�R�`��,,,,,,,,,,,,,,,,,,,,,,,,,,,,,,,,,�R�`��,,,,,,,,,,,,,,,,,,,
������,1,,0,,,,0,,,,,,,,,,,,,,,,0,,,,,,,,,,������,0,0,0,0,,0,,,0,0,,,,0,,0,,,
��錧,0,,0,,,,0,0,,0,0,0,0,,,,,,,,,,,,,,,,,,,,��錧,0,0,,,,,,,,,,,,,,,,,
�Ȗ،�,2,,0,,,,0,0,,0,0,,,,,,,,,,,,2,,,,,,,,0,,�Ȗ،�,,,,,,,,,,,,,,,,,,,
�Q�n��,1,,,,,,,0,,,1,,,0,,,,,,,,,,,,,,,,,0,,�Q�n��,,,,,,,,,,,,,,,,,,,
��ʌ�,30,,0,,,,0,0,0,0,24,,1,2,,0,,,0,,,,3,,,,,,,0,0,,��ʌ�,0,0,0,0,,,,,,,,,,,,,,,
��t��,5,,1,,,,1,3,,0,0,,0,0,,1,1,,0,,,,0,,,,,,,0,0,,��t��,0,0,,,,,,,,,,,,,,,,,
�����s,61,,7,,,,7,0,,,28,0,7,1,0,1,1,,0,,,,13,,,,,,,2,2,,�����s,0,0,0,,0,0,0,,0,,,,,,0,,,,
�_�ސ쌧,3,0,0,,,,0,0,0,0,1,,0,1,,0,0,,,,,,0,,,,,,,0,0,,�_�ސ쌧,1,1,,,0,0,,,0,0,,,,0,,0,,,
�V����,,,,,,,,,,,,,,,,,,,,,,,,,,,,,,,,,�V����,,,,,,,,,,,,,,,,,,,
�x�R��,,,,,,,,,,,,,,,,,,,,,,,,,,,,,,,,,�x�R��,,,,,,,,,,,,,,,,,,,
�ΐ쌧,,,,,,,,,,,,,,,,,,,,,,,,,,,,,,,,,�ΐ쌧,,,,,,,,,,,,,,,,,,,
���䌧,0,,0,,,,0,,,,,,,,,,,,,,,,,,,,,,,,,,���䌧,,,,,,,,,,,,,,,,,,,
�R����,,,,,,,,,,,,,,,,,,,,,,,,,,,,,,,,,�R����,,,,,,,,,,,,,,,,,,,
���쌧,,,,,,,,,,,,,,,,,,,,,,,,,,,,,,,,,���쌧,,,,,,,,,,,,,,,,,,,
�򕌌�,,,,,,,,,,,,,,,,,,,,,,,,,,,,,,,,,�򕌌�,,,,,,,,,,,,,,,,,,,
�É���,,,,,,,,,,,,,,,,,,,,,,,,,,,,,,,,,�É���,,,,,,,,,,,,,,,,,,,
���m��,0,,,,,,,,,,0,,,,,,,,,,,,,,,,,,,,,,���m��,,,,,,,,,,,,,,,,,,,
�O�d��,1,,,,,,,,,,,,,,,,,,,,,,1,,,,,,,,,,�O�d��,,,,,,,,,,,,,,,,,,,
���ꌧ,,,,,,,,,,,,,,,,,,,,,,,,,,,,,,,,,���ꌧ,,,,,,,,,,,,,,,,,,,
���s�{,,,,,,,,,,,,,,,,,,,,,,,,,,,,,,,,,���s�{,,,,,,,,,,,,,,,,,,,
���{,0,,0,,,,0,,,,,,,,,,,,,,,,,,,,,,,,,,���{,,,,,,,,,,,,,,,,,,,
���Ɍ�,0,,0,,,,0,,0,,,,,,,,,,,,,,,,,,,,,,,,���Ɍ�,,,,,,,,,,,,,,,,,,,
�ޗǌ�,,,,,,,,,,,,,,,,,,,,,,,,,,,,,,,,,�ޗǌ�,,,,,,,,,,,,,,,,,,,
�a�̎R��,,,,,,,,,,,,,,,,,,,,,,,,,,,,,,,,,�a�̎R��,,,,,,,,,,,,,,,,,,,
���挧,,,,,,,,,,,,,,,,,,,,,,,,,,,,,,,,,���挧,,,,,,,,,,,,,,,,,,,
������,,,,,,,,,,,,,,,,,,,,,,,,,,,,,,,,,������,,,,,,,,,,,,,,,,,,,
���R��,,,,,,,,,,,,,,,,,,,,,,,,,,,,,,,,,���R��,,,,,,,,,,,,,,,,,,,
�L����,0,,0,,,,0,,,,,,,,,,,,,,,,,,,,,,,,,,�L����,,,,,,,,,,,,,,,,,,,
�R����,,,,,,,,,,,,,,,,,,,,,,,,,,,,,,,,,�R����,,,,,,,,,,,,,,,,,,,
������,,,,,,,,,,,,,,,,,,,,,,,,,,,,,,,,,������,,,,,,,,,,,,,,,,,,,
���쌧,,,,,,,,,,,,,,,,,,,,,,,,,,,,,,,,,���쌧,,,,,,,,,,,,,,,,,,,
���Q��,,,,,,,,,,,,,,,,,,,,,,,,,,,,,,,,,���Q��,,,,,,,,,,,,,,,,,,,
���m��,,,,,,,,,,,,,,,,,,,,,,,,,,,,,,,,,���m��,,,,,,,,,,,,,,,,,,,
������,0,,0,,,,0,0,,,,,,,,,,,,,,,,,,,,,,,,,������,0,,0,,,,,,,,,,,,,,,,
���ꌧ,,,,,,,,,,,,,,,,,,,,,,,,,,,,,,,,,���ꌧ,,,,,,,,,,,,,,,,,,,
���茧,,,,,,,,,,,,,,,,,,,,,,,,,,,,,,,,,���茧,,,,,,,,,,,,,,,,,,,
�F�{��,0,,,,,,,,,,0,,,,,,,,,,,,,,,,,,,,,,�F�{��,,,,,,,,,,,,,,,,,,,
�啪��,,,,,,,,,,,,,,,,,,,,,,,,,,,,,,,,,�啪��,,,,,,,,,,,,,,,,,,,
�{�茧,,,,,,,,,,,,,,,,,,,,,,,,,,,,,,,,,�{�茧,,,,,,,,,,,,,,,,,,,
��������,,,,,,,,,,,,,,,,,,,,,,,,,,,,,,,,,��������,,,,,,,,,,,,,,,,,,,
���ꌧ,,,,,,,,,,,,,,,,,,,,,,,,,,,,,,,,,���ꌧ,,,,,,,,,,,,,,,,,,,
�k�C��,0,,,,,,,,,,,,0,0,,,,,,,,,,,,,,,,,,,�k�C��,,,,,,,,,,,,,,,,,,,
���k,1,,0,,,,0,,,,,,,,,,,,,,,,0,,,,,,,,,,���k,0,0,0,0,,0,,,0,0,,,,0,,0,,,
�֓�,103,0,8,,,,8,4,0,0,54,0,8,4,0,3,2,,0,,,,17,,,,,,,2,2,,�֓�,1,1,0,0,0,0,0,,0,0,,,,0,0,0,,,
�b�M�z,0,,0,,,,0,,,,,,,,,,,,,,,,,,,,,,,,,,�b�M�z,,,,,,,,,,,,,,,,,,,
���C�E����,1,,,,,,,,,,0,,,,,,,,,,,,1,,,,,,,,,,���C�E����,,,,,,,,,,,,,,,,,,,
�ߋE,0,,0,,,,0,,0,,,,,,,,,,,,,,,,,,,,,,,,�ߋE,,,,,,,,,,,,,,,,,,,
�����E�l��,0,,0,,,,0,,,,,,,,,,,,,,,,,,,,,,,,,,�����E�l��,,,,,,,,,,,,,,,,,,,
��B�E����,0,,0,,,,0,0,,,0,,,,,,,,,,,,,,,,,,,,,,��B�E����,0,,0,,,,,,,,,,,,,,,,
