�s���{���R�[�h���͎s�撬���R�[�h,NO,�s���{����,�s�撬����,�C�x���g��,�C�x���g��_�J�i,�C�x���g��_�p��,�J�n��,�I����,�J�n����,�I������,�J�n�������L����,����,����(��{),����(�ڍ�),�A���於��,�A����d�b�ԍ�,�A��������ԍ�,��Î�,�ꏊ����,�Z��,����,�ܓx,�o�x,�A�N�Z�X���@,���ԏ���,���,�Q���\���I����,�Q���\���I������,�Q���\�����@,URL,���l,�X�֔ԍ�,���ÁE����,����_�v��,���_�L��,�����i0�`2�΁j,�c���i3�`6�΁j,���w���i��w�N�j,���w���i���w�N�j,���w���i���w�N�j,���w��,���Z��,���̑��Z����,�\��\��_�v��,�Q������_�L��,�Q������_�ڍ�,���ԏ�_�L��,������_�L��,������_�ڍ�,�摜,�摜_���C�Z���X,�摜_�ڍ�,�ŏI�m�F��
132195,1,�����s,���]�s,�q�ǂ����͂Ȃ���,�R�h���I�n�i�V�J�C,,2018/12/5,2018/12/5,15:30,16:00,,�G�{�̓ǂݕ������E�܂莆���s���܂��B,,,���]�s���}����,03-3488-4414,,���]�s���}����,���]�s�������}����,�����s���]�s�a��{��1-1-5,�s���Z���^�[�P�K,35.635125,139.578176,���c�}�����]�w���k���R��,,,,,,,,201-0003,,0,0,0,1,1,0,0,0,0,0,0,0,,1,0,,,,,2018/11/26
132195,2,�����s,���]�s,�q�ǂ����͂Ȃ���,�R�h���I�n�i�V�J�C,,2018/12/12,2018/12/12,15:30,16:00,,�G�{�̓ǂݕ�������܂莆���s���܂��B,,,���]�s���}����,03-3488-4414,,���]�s���}����,���]�s�������}����,�����s���]�s�a��{��1-1-5,�s���Z���^�[�P�K,35.635125,139.578176,���c�}�����]�w���k���R��,,,,,,,,201-0003,,0,0,0,1,1,0,0,0,0,0,0,0,,1,0,,,,,2018/11/26
132195,3,�����s,���]�s,�N���X�}�X���͂Ȃ���,�N���X�}�X�I�n�i�V�J�C,,2018/12/19,2018/12/19,15:30,16:00,,�N���X�}�X�̊G�{�̓ǂݕ�������p�l���V�A�^�[�A�ȒP�ȍH����s���܂��B,,,���]�s���}����,03-3488-4414,,���]�s���}����,���]�s�������}����,�����s���]�s�a��{��1-1-5,�s���Z���^�[�P�K,35.635125,139.578176,���c�}�����]�w���k���R��,,,,,,,,201-0003,,0,0,0,1,1,0,0,0,0,0,0,0,,1,0,,,,,2018/11/26
132195,4,�����s,���]�s,�q�ǂ����͂Ȃ���,�R�h���I�n�i�V�J�C,,2018/12/26,2018/12/26,15:30,16:00,,�G�{�̓ǂݕ�������܂莆���s���܂��B,,,���]�s���}����,03-3488-4414,,���]�s���}����,���]�s�������}����,�����s���]�s�a��{��1-1-5,�s���Z���^�[�P�K,35.635125,139.578176,���c�}�����]�w���k���R��,,,,,,,,201-0003,,0,0,0,1,1,0,0,0,0,0,0,0,,1,0,,,,,2018/11/26
132195,5,�����s,���]�s,�e�q�Ŋy���ނ��͂Ȃ���i0�E1�΁j,�I���R�f�^�m�V���I�n�i�V�J�C�i0�E1�T�C�j,,2018/12/13,2018/12/13,10:30,10:45,,�G�{�̓ǂݕ���������ׂ������s���܂�,,,���]�s���}����,03-3488-4414,,���]�s���}����,���]�s�������}����,�����s���]�s�a��{��1-1-5,�s���Z���^�[�P�K,35.635125,139.578176,���c�}�����]�w���k���R��,,,,,,,,201-0003,,0,0,1,0,0,0,0,0,0,0,0,0,,1,0,,,,,2018/11/26
132195,6,�����s,���]�s,�e�q�Ŋy���ނ��͂Ȃ���i0�E1�΁j,�I���R�f�^�m�V���I�n�i�V�J�C�i0�E1�T�C�j,,2018/12/27,2018/12/27,10:30,10:45,,�G�{�̓ǂݕ���������ׂ������s���܂�,,,���]�s���}����,03-3488-4414,,���]�s���}����,���]�s�������}����,�����s���]�s�a��{��1-1-5,�s���Z���^�[�P�K,35.635125,139.578176,���c�}�����]�w���k���R��,,,,,,,,201-0003,,0,0,1,0,0,0,0,0,0,0,0,0,,1,0,,,,,2018/11/26
132195,7,�����s,���]�s,�e�q�Ŋy���ނ��͂Ȃ���i2�E3�΁j,�I���R�f�^�m�V���I�n�i�V�J�C�i2�E3�T�C�j,,2018/12/13,2018/12/13,11:00,11:20,,�G�{�̓ǂݕ���������ׂ������s���܂�,,,���]�s���}����,03-3488-4414,,���]�s���}����,���]�s�������}����,�����s���]�s�a��{��1-1-5,�s���Z���^�[�P�K,35.635125,139.578176,���c�}�����]�w���k���R��,,,,,,,,201-0003,,0,0,1,1,0,0,0,0,0,0,0,0,,1,0,,,,,2018/11/26
132195,8,�����s,���]�s,�e�q�Ŋy���ނ��͂Ȃ���i2�E3�΁j,�I���R�f�^�m�V���I�n�i�V�J�C�i2�E3�T�C�j,,2018/12/27,2018/12/27,11:00,11:20,,�G�{�̓ǂݕ���������ׂ������s���܂�,,,���]�s���}����,03-3488-4414,,���]�s���}����,���]�s�������}����,�����s���]�s�a��{��1-1-5,�s���Z���^�[�P�K,35.635125,139.578176,���c�}�����]�w���k���R��,,,,,,,,201-0003,,0,0,1,1,0,0,0,0,0,0,0,0,,1,0,,,,,2018/11/26
132195,9,�����s,���]�s,�N���X�}�X�ʂ�����݂��Ƃ܂��,�N���X�}�X�k�C�O���~�I�g�}���J�C,,2018/12/24,2018/12/27,10:30,16:00,,�G�{�̓ǂݕ��������s���܂�,,,���]�s���}����,03-3488-4414,,���]�s���}����,���]�s�������}����,�����s���]�s�a��{��1-1-5,�s���Z���^�[�P�K,35.635125,139.578176,���c�}�����]�w���k���R��,,15,,,,,,201-0003,,0,1,0,1,1,0,0,0,0,0,1,1,�S�`�W�΂̎q�ǂ�,1,0,,,,,2018/11/26
132195,10,�����s,���]�s,���]�s���h�c�o����,�R�}�G�V�V���E�{�E�_���f�]���V�L,,2019/1/13,2019/1/13,10:00,11:30,,���h�c���ɂ����h�|���v�����ԑ��@���ĕ��������s���܂��B,,,���]�s���S���S��,03-3430-1111,,���]�s���h�c,������Βn�����O�����h,�����s���]�s����4-1,,35.624131,139.573537,���c�}���a�򑽖���w�k���R��,,,,,,,,201-0015,,0,0,1,1,1,1,1,1,1,1,0,0,,0,0,,,,,2018/11/29
132195,11,�����s,���]�s,�N���X�}�X�H����,�N���X�}�X�V���N�W�J�C,,2018/12/1,2018/12/1,12:00,14:50,,���������������݂�ȂŊy�����H�ׂ�N���X�}�X�C�x���g,,�t���Y����l500�~,���]�s����������,03-3488-4411,,���ǂ��̑������H��,���]�s����������,�����s���]�s�a��{��1-1-5,�s���Z���^�[B�P�K,35.635212,139.57824,���c�}�����]�w���k���R��,,,,,,,����ɒB���܂����B,201-0003,,1,1,0,1,1,1,1,0,0,0,1,0,,0,0,,,,,2018/11/27
132195,12,�����s,���]�s,���܂����t�܂�,�R�}�G�n�c�n���}�c��,,2019/1/13,2019/1/13,9:00,12:00,���H�u�[�X��10�F00,������͐�~�O���E���h�ŏ��h�c�o�����A�ǂ�ǏāA���[�h���[�X�̂R�̃C�x���g�����킹�����܂��̓~�̕�����,,,���]�s�鏑�L��,03-3430-1149,,���]�s,������Βn�����O�����h,�����s���]�s����4-1,,35.624131,139.573537,���c�}���a�򑽖���w�k���R��,,,,,,,,201-0015,,0,0,1,1,1,1,1,1,1,1,0,0,,0,0,,,,,2018/11/27
132195,13,�����s,���]�s,���܂����܂�,�R�}�G�T�N���}�c��,,2019/4/7,2019/4/7,10:00,16:00,,���삳����ʂ�����ɁA���H�e���g��L�b�`���J�[���o�X���邱�܂��̏t�̕�����,,,���]�s�鏑�L��,03-3430-1149,,���]�s�E���܂����܂���s�ψ���,���삳����ʂ�,�����s���]�s���a��4-16,,35.63604,139.564146,���c�}���u���]�w�v����k��20���@�u���]�w�v����u������Z����v�s���o�X�u������Z�����i�Z��������ʂ�j�v����,,,,,,,,201-0012,,0,0,1,1,1,1,1,1,1,1,0,0,,0,0,,,,,2018/11/27
132195,14,�����s,���]�s,�ɂ�����炨�͂Ȃ���,�j�V�K�����I�n�i�V�J�C,,2018/12/6,2018/12/13,15:45,16:30,,�G�{�̓ǂݕ������A�܂莆��H����s���܂��i�e�q�Q���j�B,,,���]�s�����͌�������,03-3480-3201,,���]�s������,���]�s�����͌�������,�����s���]�s���a��2-35-1,���͌������قQ�K�c����,35.633466,139.56704,���c�}���u���]�w�v����k��15���@�u���]�w�v����u������Z��v�s���o�X�u������ّO�v����,�a�P�e�ɖ������ԏ�L��,,,,,,,201-0013,,0,1,1,1,1,0,0,0,0,1,0,0,,1,0,,,,,2018/11/27
132195,15,�����s,���]�s,�N���X�}�X�Ƃ��ׂ��͂Ȃ���,�N���X�}�X�g�N�x�c�I�n�i�V�J�C,,2018/12/20,2018/12/20,15:45,16:30,,�G�{�̓ǂݕ������A��V�тȂǂ��s���܂��i�e�q�Q���j�B,,,���]�s�����͌�������,03-3480-3201,,���]�s������,���]�s�����͌�������,�����s���]�s���a��2-35-1,���͌������قQ�K�c����,35.633466,139.56704,���c�}���u���]�w�v����k��15���@�u���]�w�v����u������Z��v�s���o�X�u������ّO�v����,�a�P�e�ɖ������ԏ�L��,,,,,,,201-0013,,0,1,1,1,1,0,0,0,0,1,0,0,,1,0,,,,,2018/11/27
132195,16,�����s,���]�s,���������q��ă��[��,�C�L�C�L�R�\�_�e���[��,,2018/12/7,2018/12/7,10:00,12:00,,���c���Ƃ��̕ی�҂̌𗬂̏���,,,���]�s�����͌�������,03-3480-3201,,���]�s������,���]�s�����͌�������,�����s���]�s���a��2-35-1,���͌������قQ�K�c����,35.633466,139.56704,���c�}���u���]�w�v����k��15���@�u���]�w�v����u������Z��v�s���o�X�u������ّO�v����,�a�P�e�ɖ������ԏ�L��,,,,,,,201-0013,,0,0,1,1,0,0,0,0,0,1,0,0,,1,0,,,,,2018/11/27
132195,17,�����s,���]�s,���������q��ă��[��,�C�L�C�L�R�\�_�e���[��,,2018/12/14,2018/12/14,10:00,12:00,,���c���Ƃ��̕ی�҂̌𗬂̏���,,,���]�s�����͌�������,03-3480-3201,,���]�s������,���]�s�����͌�������,�����s���]�s���a��2-35-1,���͌������قQ�K�c����,35.633466,139.56704,���c�}���u���]�w�v����k��15���@�u���]�w�v����u������Z��v�s���o�X�u������ّO�v����,�a�P�e�ɖ������ԏ�L��,,,,,,,201-0013,,0,0,1,1,0,0,0,0,0,1,0,0,,1,0,,,,,2018/11/27
132195,18,�����s,���]�s,���������q��ă��[��,�C�L�C�L�R�\�_�e���[��,,2018/12/21,2018/12/21,10:00,12:00,,���c���Ƃ��̕ی�҂̌𗬂̏���,,,���]�s�����͌�������,03-3480-3201,,���]�s������,���]�s�����͌�������,�����s���]�s���a��2-35-1,���͌������قQ�K�c����,35.633466,139.56704,���c�}���u���]�w�v����k��15���@�u���]�w�v����u������Z��v�s���o�X�u������ّO�v����,�a�P�e�ɖ������ԏ�L��,,,,,,,201-0013,,0,0,1,1,0,0,0,0,0,1,0,0,,1,0,,,,,2018/11/27
132195,19,�����s,���]�s,���N�X�|�[�c�����i�o�X�P�b�g�{�[���j,�Z�C�V���E�l���X�|�[�c�L���E�V�c�i�o�X�P�b�g�{�[���j,,2018/12/23,2018/12/23,9:00,11:15,,�o�X�P�b�g�̃��[���̗����A�Z�p�̏C����}��A�Q�[���̐i�ߕ����w�����鋳���B,600,�ی����A���Օi��,���]�s�Љ���,03-3430-1111,,���]�s�Љ���,���a��̈��,�����s���]�s���a��1-16-1,,35.639538,139.565247,���c�}�����]�w���u���܃o�X�v�k���5�����a��l���ډ��ԓk��5��,,50,,,,,,201-0011,,1,1,0,0,0,1,1,1,0,0,1,1,���w�Z�R�N���`���w�Z�Q�N��,0,0,,,,,2018/11/26
132195,20,�����s,���]�s,���N�X�|�[�c�����i�o�X�P�b�g�{�[���j,�Z�C�V���E�l���X�|�[�c�L���E�V�c�i�o�X�P�b�g�{�[���j,,2018/12/24,2018/12/24,9:00,11:15,,�o�X�P�b�g�̃��[���̗����A�Z�p�̏C����}��A�Q�[���̐i�ߕ����w�����鋳���B,600,�ی����A���Օi��,���]�s�Љ���,03-3430-1111,,���]�s�Љ���,���a��̈��,�����s���]�s���a��1-16-1,,35.639538,139.565247,���c�}�����]�w���u���܃o�X�v�k���5�����a��l���ډ��ԓk��5��,,50,,,,,,201-0011,,1,1,0,0,0,1,1,1,0,0,1,1,���w�Z�R�N���`���w�Z�Q�N��,0,0,,,,,2018/11/26
132195,21,�����s,���]�s,���N�X�|�[�c�����i�o�X�P�b�g�{�[���j,�Z�C�V���E�l���X�|�[�c�L���E�V�c�i�o�X�P�b�g�{�[���j,,2019/1/6,2019/1/6,9:00,11:15,,�o�X�P�b�g�̃��[���̗����A�Z�p�̏C����}��A�Q�[���̐i�ߕ����w�����鋳���B,600,�ی����A���Օi��,���]�s�Љ���,03-3430-1111,,���]�s�Љ���,���]�s�������̈��,�����s���]�s�a��{��3-25-1,,35.641575,139.572845,���c�}���u���]�w�v����k��20���B�o�X�F���z�w����s�E���b����O�a�@�s�E�������w����s�E���]�c�Ə��s�u���]�s���Ζ쏬�w�Z�v���ԓk��5��,,50,,,,,,201-0003,,1,1,0,0,0,1,1,1,0,0,1,1,���w�Z�R�N���`���w�Z�Q�N��,0,0,,,,,2018/11/26
132195,22,�����s,���]�s,���N�X�|�[�c�����i�o�X�P�b�g�{�[���j,�Z�C�V���E�l���X�|�[�c�L���E�V�c�i�o�X�P�b�g�{�[���j,,2019/1/13,2019/1/13,9:00,11:15,,�o�X�P�b�g�̃��[���̗����A�Z�p�̏C����}��A�Q�[���̐i�ߕ����w�����鋳���B,600,�ی����A���Օi��,���]�s�Љ���,03-3430-1111,,���]�s�Љ���,���]�s�������̈��,�����s���]�s�a��{��3-25-1,,35.641575,139.572845,���c�}���u���]�w�v����k��20���B�o�X�F���z�w����s�E���b����O�a�@�s�E�������w����s�E���]�c�Ə��s�u���]�s���Ζ쏬�w�Z�v���ԓk��5��,,50,,,,,,201-0003,,1,1,0,0,0,1,1,1,0,0,1,1,���w�Z�R�N���`���w�Z�Q�N��,0,0,,,,,2018/11/26
132195,23,�����s,���]�s,���N�X�|�[�c�����i�o�X�P�b�g�{�[���j,�Z�C�V���E�l���X�|�[�c�L���E�V�c�i�o�X�P�b�g�{�[���j,,2019/1/20,2019/1/20,9:00,11:15,,�o�X�P�b�g�̃��[���̗����A�Z�p�̏C����}��A�Q�[���̐i�ߕ����w�����鋳���B,600,�ی����A���Օi��,���]�s�Љ���,03-3430-1111,,���]�s�Љ���,���a��̈��,�����s���]�s���a��1-16-1,,35.639538,139.565247,���c�}�����]�w���u���܃o�X�v�k���5�����a��l���ډ��ԓk��5��,,50,,,,,,201-0011,,1,1,0,0,0,1,1,1,0,0,1,1,���w�Z�R�N���`���w�Z�Q�N��,0,0,,,,,2018/11/26
132195,24,�����s,���]�s,���N�X�|�[�c�����i�o�X�P�b�g�{�[���j,�Z�C�V���E�l���X�|�[�c�L���E�V�c�i�o�X�P�b�g�{�[���j,,2019/1/27,2019/1/27,9:00,11:15,,�o�X�P�b�g�̃��[���̗����A�Z�p�̏C����}��A�Q�[���̐i�ߕ����w�����鋳���B,600,�ی����A���Օi��,���]�s�Љ���,03-3430-1111,,���]�s�Љ���,���]�s�������̈��,�����s���]�s�a��{��3-25-1,,35.641575,139.572845,���c�}���u���]�w�v����k��20���B�o�X�F���z�w����s�E���b����O�a�@�s�E�������w����s�E���]�c�Ə��s�u���]�s���Ζ쏬�w�Z�v���ԓk��5��,,50,,,,,,201-0003,,1,1,0,0,0,1,1,1,0,0,1,1,���w�Z�R�N���`���w�Z�Q�N��,0,0,,,,,2018/11/26
132195,25,�����s,���]�s,�����샍�[�h���[�X���,�^�}�K�����[�h���[�X�^�C�J�C,,2019/1/13,2019/1/13,8:30,13:00,,���]�s������Βn�����O�����h�t�߂𔭒��_�Ƃ� �������h���呖�H�Ƃ���B,"2,000",,���]�s���㋣�Z����i���c�j,090-4752-5902,,���]�s�Љ���,������Βn�����O�����h,�����s���]�s����4-1,������Βn�����O�����h,35.624505,139.573777,���c�}���a�򑽖���w�E���c�}���o�ˉw����k��,,100,,,,,�P�q�i���w���P�E�Q�N�j,201-0015,,1,1,0,0,1,0,0,0,0,1,1,1,,0,0,,,,,2018/11/26
132195,26,�����s,���]�s,�����샍�[�h���[�X���,�^�}�K�����[�h���[�X�^�C�J�C,,2019/1/13,2019/1/13,8:30,13:00,,���]�s������Βn�����O�����h�t�߂𔭒��_�Ƃ� �������h���呖�H�Ƃ���B,"2,000",,���]�s���㋣�Z����i���c�j,090-4752-5902,,���]�s�Љ���,������Βn�����O�����h,�����s���]�s����4-1,������Βn�����O�����h,35.624505,139.573777,���c�}���a�򑽖���w�E���c�}���o�ˉw����k��,,100,,,,,�Q�q�i���w���R�`�U�N�j,201-0015,,1,1,0,0,0,1,1,0,0,1,1,1,,0,0,,,,,2018/11/26
132195,27,�����s,���]�s,�����샍�[�h���[�X���,�^�}�K�����[�h���[�X�^�C�J�C,,2019/1/13,2019/1/13,8:30,13:00,,���]�s������Βn�����O�����h�t�߂𔭒��_�Ƃ� �������h���呖�H�Ƃ���B,"2,000",,���]�s���㋣�Z����i���c�j,090-4752-5902,,���]�s�Љ���,������Βn�����O�����h,�����s���]�s����4-1,������Βn�����O�����h,35.624505,139.573777,���c�}���a�򑽖���w�E���c�}���o�ˉw����k��,,100,,,,,�R�q�i���w���j,201-0015,,1,1,0,0,0,0,0,1,0,1,1,1,,0,0,,,,,2018/11/26
132195,28,�����s,���]�s,�����샍�[�h���[�X���,�^�}�K�����[�h���[�X�^�C�J�C,,2019/1/13,2019/1/13,8:30,13:00,,���]�s������Βn�����O�����h�t�߂𔭒��_�Ƃ� �������h���呖�H�Ƃ���B,"2,000",,���]�s���㋣�Z����i���c�j,090-4752-5902,,���]�s�Љ���,������Βn�����O�����h,�����s���]�s����4-1,������Βn�����O�����h,35.624505,139.573777,���c�}���a�򑽖���w�E���c�}���o�ˉw����k��,,100,,,,,�T�q�E�P�O�q�i���Z���ȏ�j,201-0015,,1,1,0,0,0,0,0,0,1,1,1,1,,0,0,,,,,2018/11/26
132195,29,�����s,���]�s,���l�X�|�[�c�����i������j,�Z�C�W���X�|�[�c�L���E�V�c�i�t�L���j,,2019/2/9,2019/2/9,9:00,11:15,,���N���G�[�V�����������ʂ��āA�^������K����g�ɂ����N�I�Ȑ������c�߂�悤�ɂ���ƂƂ��ɁA���ԂÂ�������邱�Ƃ�ړI�Ƃ���B,100,���Օi��,���]�s�Љ���,03-3430-1111,,���]�s�Љ���,���]�s�������̈��,�����s���]�s�a��{��3-25-1,�s�������̈�ف@�Q�e��c��,35.641575,139.572845,���c�}���u���]�w�v����k��20���B�o�X�F���z�w����s�E���b����O�a�@�s�E�������w����s�E���]�c�Ə��s�u���]�s���Ζ쏬�w�Z�v���ԓk��5��,,15,,,,,,201-0003,,1,1,0,0,0,0,0,0,0,1,1,1,18�Έȏ�,0,0,,,,,2018/11/26
132195,30,�����s,���]�s,���l�X�|�[�c�����i������j,�Z�C�W���X�|�[�c�L���E�V�c�i�t�L���j,,2019/2/16,2019/2/16,9:00,11:15,,���N���G�[�V�����������ʂ��āA�^������K����g�ɂ����N�I�Ȑ������c�߂�悤�ɂ���ƂƂ��ɁA���ԂÂ�������邱�Ƃ�ړI�Ƃ���B,100,���Օi��,���]�s�Љ���,03-3430-1111,,���]�s�Љ���,���]�s�������̈��,�����s���]�s�a��{��3-25-1,�s�������̈�ف@�Q�e��c��,35.641575,139.572845,���c�}���u���]�w�v����k��20���B�o�X�F���z�w����s�E���b����O�a�@�s�E�������w����s�E���]�c�Ə��s�u���]�s���Ζ쏬�w�Z�v���ԓk��5��,,15,,,,,,201-0003,,1,1,0,0,0,0,0,0,0,1,1,1,18�Έȏ�,0,0,,,,,2018/11/26
132195,31,�����s,���]�s,������Ƒ����N���X�}�X���͂Ȃ���u�݂�Ȃɉ̂̃v���[���g�I�ꏏ�ɉ̂��Ċy��������Let's sing�v,�`���b�g�n���C�N���X�}�X�I�n�i�V�J�C�u�~���i�j�E�^�m�v���[���g�I�C�b�V���j�E�^�b�e�^�m�V���E�􃌃b�c�V���O�v,,2018/12/7,2018/12/7,10:00,11:00,,���c���Ƃ��̕ی�ґΏہB�p�l���V�A�^�[�u����Ă�ڂ��̃T���^�N���[�X�v�A�e�q�H��u�N���X�}�X���[�X�v�B,,,���n��Z���^�[,03-3480-2211,,���n��Z���^�[,���n��Z���^�[,�����s���]�s�����1-6-9,,35.646373,139.575472,���܃o�X�k���u���n��Z���^�[���v���ԓk��2��,����,,,,,https://www.city.komae.tokyo.jp/events/index.cfm/detail.4.96633.html,,201-0001,,0,0,1,1,0,0,0,0,0,1,0,0,,0,0,,,,,2018/11/26
132195,32,�����s,���]�s,���]�Ƃ����щ��y���E�N���X�}�X�R���T�[�g,�R�}�G�g���V�r�I���K�N�^�C�E�N���X�}�X�R���T�[�g,,2018/12/9,2018/12/9,13:30,15:30,,���a�̉��������̗w�Ȃ̉��t,,,���n��Z���^�[,03-3480-2211,,���n��Z���^�[,���n��Z���^�[,�����s���]�s�����1-6-9,,35.646373,139.575472,���܃o�X�k���u���n��Z���^�[���v���ԓk��2��,����,,,,,https://www.city.komae.tokyo.jp/events/index.cfm/detail.4.96634.html,,201-0001,,0,0,1,1,1,1,1,1,1,1,0,0,,0,0,,,,,2018/11/26
132195,33,�����s,���]�s,�Ȃ�Ԏq�ǂ��N���X�}�X��i�ΏێҁF���c���j,�i���u�R�h���N���X�}�X�J�C(�^�C�V���E�V���F�j���E���E�W�j,,2018/12/12,2018/12/12,10:30,11:30,,�l�`���T�[�N���u�Ԃ�Ԃ�v�ɂ��l�`���u�R�т��̂��Ԃ��̂�����Ƃ����������b�v���B,,,�암�n��Z���^�[,03-3489-2150,,�암�n��Z���^�[,�암�n��Z���^�[,�����s���]�s����4-11-1,,35.62363,139.579847,���c�}���a�򑽖���w���k��15��,,,,,, https://www.city.komae.tokyo.jp/events/index.cfm/detail.4.96635.html,,201-0015,,0,0,1,1,0,0,0,0,0,1,0,0,,0,0,,,,,2018/11/26
132195,34,�����s,���]�s,�Ȃ�Ԏq�ǂ��N���X�}�X��i�ΏێҁF�c���`���w�Z��w�N�j,�i���u�R�h���N���X�}�X�J�C(�^�C�V���E�V���F���E�W�`�V���E�K�b�R�E�e�C�K�N�l���j,,2018/12/12,2018/12/12,15:00,16:00,,�l�`���T�[�N���u�Ԃ�Ԃ�v�ɂ��l�`���u�R�т��̂��Ԃ��̂�����Ƃ����������b�v���B,,,�암�n��Z���^�[,03-3489-2150,,�암�n��Z���^�[,�암�n��Z���^�[,�����s���]�s����4-11-1,,35.62363,139.579847,���c�}���a�򑽖���w���k��15��,,,,,, https://www.city.komae.tokyo.jp/events/index.cfm/detail.4.96635.html,,201-0015,,0,0,0,1,1,0,0,0,0,0,0,0,,0,0,,,,,2018/11/26
132195,35,�����s,���]�s,�G�莆�Ђ��,�G�e�K�~�q���o,,2018/12/6,2018/12/6,10:00,12:00,,�G�莆����������A�h�o�C�X���󂯂��܂��B,,,�u�G�莆���˂̒n�|���]�v���s�ψ�����ǁi��ʍ��c�@�l���]�s�����U�����ƒc�j,03-3430-4106,,��ʍ��c�@�l���]�s�����U�����ƒc,�G�R���}�z�[���U�K�W���E���ړI��,�����s���]�s���a��1-2-1,,35.633418,139.57801,���c�}�����]�w���k��0��,�n���ɗL�����ԏ�L,,,,, https://www.city.komae.tokyo.jp/events/index.cfm/detail.4.96641.html ,,201-0013,,0,0,1,1,1,1,1,1,1,1,0,0,,1,0,,,,,2018/11/26
132195,36,�����s,���]�s,�G�莆�Ђ��,�G�e�K�~�q���o,,2018/12/20,2018/12/20,10:00,12:00,,�G�莆����������A�h�o�C�X���󂯂��܂��B,,,�u�G�莆���˂̒n�|���]�v���s�ψ�����ǁi��ʍ��c�@�l���]�s�����U�����ƒc�j,03-3430-4106,,��ʍ��c�@�l���]�s�����U�����ƒc,�s�����Q�K���r�[,�����s���]�s�a��{��1-1-5,,35.634923,139.578751,���c�}�����]�w���k��3��,�s�����L�����ԏ�,,,,,https://www.city.komae.tokyo.jp/events/index.cfm/detail.4.96642.html,,201-8585,,0,0,1,1,1,1,1,1,1,1,0,0,,1,0,,,,,2018/11/26
132195,37,�����s,���]�s,�w�u���A�[�e�B�X�g�w�O���C�u,�w�u���A�[�e�B�X�g�G�L�}�G���C�u,,2018/12/2,2018/12/2,13:00,13:30,,�����s���F�w�u���A�[�e�B�X�g���o������w�O���C�u�B�o���F�Ƃ��Ă񂽂�i�W���X�A���a�̗w�A�|�b�v�X�j,,,��ʍ��c�@�l���]�s�����U�����ƒc,03-3430-4106,,��ʍ��c�@�l���]�s�����U�����ƒc,���]�w�k����ʍL��,�����s���]�s���a��1-17,,35.632542,139.57727,���c�}�����]�w���k��0��,,,,,, https://www.city.komae.tokyo.jp/events/index.cfm/detail.45.96644.html ,,201-0013,,0,0,1,1,1,1,1,1,1,1,0,0,,0,0,,,,,2018/11/26
132195,38,�����s,���]�s,��216�񂩂킹�݃R���T�[�g�u�N���X�}�X���n���Ձj,�_�C216�J�C�J���Z�~�R���T�[�g�u�N���X�}�X���o�g�E�L���v,,2018/12/15,2018/12/15,14:00,16:00,,���񂸁i�N���X�}�X�R���T�[�g�j�AURUGUN�i�n���Ձj�ɂ��R���T�[�g,,,�J�ˋ��n��Z���^�[�^�c���c��i�_���j,080-1282-8166,,�J�ˋ��n��Z���^�[�^�c���c��,�J�ˋ��n��Z���^�[,�����s���]�s�����4-30-1,,35.646082,139.586617,���c�}�o�X�y��O�P�z�u���]�n�C�^�E���܂�ԏ��v���Ԃ���,����,,,,,"https://www.city.komae.tokyo.jp/events/index.cfm/detail.4.96643.html 
",,201-0002,���킹�݃R���T�[�g���s�ψ���,0,0,1,1,1,1,1,1,1,1,0,0,,1,0,,,,,2018/11/26
132195,39,�����s,���]�s,����30�N�x�������`�������e�q�������Ɓw���]�\�y�������\��x,�w�C�Z�C30�l���h�u���J�`���E�f���g�E�u���J�I���R�L���E�V�c�W�M���E�u�R�}�G�m�E�K�N�L���E�V�c�n�b�s���E�J�C�v,,2018/12/23,2018/12/23,11:00,13:00,,���w���`���Z���ɂ��w�E�d���E�J�E���ۂ̔��\�A�u�t�ɂ��\�̎�������у��[�N�V���b�v��,,,���]�s�n�抈����,03-3430-1111,,���]�s�n�抈����,���n��Z���^�[,�����s���]�s�����1-6-9,,35.646373,139.575472,���܃o�X�k���u���n��Z���^�[���v���ԓk��2��,����,,,,,,,201-0001,,0,0,1,1,1,1,1,1,1,1,0,0,,0,0,,,,,2018/11/26
132195,40,�����s,���]�s,�N�b�L�[��苳��+�N���X�}�X�p�[�e�B,�N�b�L�[�d�N���L���E�V�c�{�N���X�}�X�p�[�e�B,,2018/12/22,2018/12/22,10:00,15:00,,�N�b�L�[���ƃN���X�}�X�p�[�e�B�i���H�t���j,,,��a��n��Z���^�[,03-3489-9101,,��a��n��Z���^�[,��a��n��Z���^�[,�����s���]�s�a��{��4-7-51,,35.645153,139.568005,���܃o�X�k���u��a��n��Z���^�[�v���Ԃ���,,30,,,,https://www.city.komae.tokyo.jp/events/index.cfm/detail.4.96637.html ,,201-0003,,0,1,0,0,1,1,1,0,0,0,0,0,,0,0,,,,,2018/11/26
132195,41,�����s,���]�s,��19�񑽖��여�拽�y�|�\�t�F�X�e�B�o��,�_�C19�J�C�^�}�K�������E�C�L�L���E�h�Q�C�m�E�t�F�X�e�B�o��,,2018/12/9,2018/12/9,12:30,17:30,,�����여��Ɉʒu���镡���̎����̂����ꂼ��̋��y�|�\���I����B�܂��A�Q�������̂ɂ�鑽���여�敨�Y�W�������J�Â����B,,,���]�s�n�抈����,03-3430-1111,,�����여�拽�y�|�\�t�F�X�e�B�o�����s�ψ���A�A�[�c�J�E���V������,���]�G�R���}�z�[��,�����s���]�s���a��1-2-1,,35.633418,139.57801,���c�}�����]�w���k��0��,�n���ɗL�����ԏ�L,,,,,"http://www.city.komae.tokyo.jp/index.cfm/47,96532,561,3319,html",,201-0003,�����s,0,0,1,1,1,1,1,1,1,1,0,0,,1,0,,,,,2018/11/26
132195,42,�����s,���]�s,,,,,,,,,,,,,,,,,,,,,,,,,,,,,,,,,,,,,,,,,,,,,,,,,,
132195,43,�����s,���]�s,,,,,,,,,,,,,,,,,,,,,,,,,,,,,,,,,,,,,,,,,,,,,,,,,,
132195,44,�����s,���]�s,,,,,,,,,,,,,,,,,,,,,,,,,,,,,,,,,,,,,,,,,,,,,,,,,,
132195,45,�����s,���]�s,,,,,,,,,,,,,,,,,,,,,,,,,,,,,,,,,,,,,,,,,,,,,,,,,,
132195,46,�����s,���]�s,,,,,,,,,,,,,,,,,,,,,,,,,,,,,,,,,,,,,,,,,,,,,,,,,,
132195,47,�����s,���]�s,,,,,,,,,,,,,,,,,,,,,,,,,,,,,,,,,,,,,,,,,,,,,,,,,,
132195,48,�����s,���]�s,,,,,,,,,,,,,,,,,,,,,,,,,,,,,,,,,,,,,,,,,,,,,,,,,,
132195,49,�����s,���]�s,,,,,,,,,,,,,,,,,,,,,,,,,,,,,,,,,,,,,,,,,,,,,,,,,,
132195,50,�����s,���]�s,������������,�X�N�X�N�\�N�e�C,,2019/1/7,2019/1/9,10:00,14:30,,���c���Ώۂ̑���,,,�q�ǂ��ƒ�x���Z���^�[����ۂ�,03-5438-6606,,�q�ǂ��ƒ�x���Z���^�[����ۂ�,�����Ƃ҂��Z���^�[,�����s���]�s���a��2-35-1,,35.633349,139.56768,���c�}�����]�w���k��15���A���c�}�o�X���]�w�k����葽����Z��s�ŕ�����ّO����,����,,,,,,,201-0013,,0,0,1,0,0,0,0,0,0,0,0,0,,1,0,,,,,2018/12/20
132195,51,�����s,���]�s,�˂�˃v���C���[��,�l���l�v���C���[��,,2019/1/10,2019/1/10,10:00,11:45,,�X�L���V�b�v�����т�ی�҂̌𗬂Ȃ�,,,�q�ǂ��ƒ�x���Z���^�[����ۂ�,03-5438-6606,,�q�ǂ��ƒ�x���Z���^�[����ۂ�,�����Ƃ҂��Z���^�[,�����s���]�s���a��2-35-1,,35.633349,139.56768,���c�}�����]�w���k��15���A���c�}�o�X���]�w�k����葽����Z��s�ŕ�����ّO����,����,,,,,,,201-0013,,0,0,1,0,0,0,0,0,0,0,0,0,,1,0,,,,,2018/12/20
132195,52,�����s,���]�s,�q�ǂ����͂Ȃ���,�R�h���I�n�i�V�J�C,,2018/1/9,2018/1/9,15:30,16:00,,�G�{�̓ǂݕ������E�܂莆���s���܂��B,,,���]�s���}����,03-3488-4414,,���]�s���}����,���]�s�������}����,�����s���]�s�a��{��1-1-5,�s���Z���^�[�P�K,35.635125,139.578176,���c�}�����]�w���k���R��,����,,,,,,,201-0003,,0,0,0,1,1,0,0,0,0,0,0,0,,1,0,,,,,2018/12/20
132195,53,�����s,���]�s,�q�ǂ����͂Ȃ���,�R�h���I�n�i�V�J�C,,2019/1/16,2019/1/16,15:30,16:00,,�G�{�̓ǂݕ������E�܂莆���s���܂��B,,,���]�s���}����,03-3488-4414,,���]�s���}����,���]�s�������}����,�����s���]�s�a��{��1-1-5,�s���Z���^�[�P�K,35.635125,139.578176,���c�}�����]�w���k���R��,����,,,,,,,201-0003,,0,0,0,1,1,0,0,0,0,0,0,0,,1,0,,,,,2018/12/20
132195,54,�����s,���]�s,�q�ǂ����͂Ȃ���,�R�h���I�n�i�V�J�C,,2019/1/23,2019/1/23,15:30,16:00,,�G�{�̓ǂݕ������E�܂莆���s���܂��B,,,���]�s���}����,03-3488-4414,,���]�s���}����,���]�s�������}����,�����s���]�s�a��{��1-1-5,�s���Z���^�[�P�K,35.635125,139.578176,���c�}�����]�w���k���R��,����,,,,,,,201-0003,,0,0,0,1,1,0,0,0,0,0,0,0,,1,0,,,,,2018/12/20
132195,55,�����s,���]�s,�q�ǂ����͂Ȃ���,�R�h���I�n�i�V�J�C,,2019/1/30,2019/1/30,15:30,16:00,,�G�{�̓ǂݕ������E�܂莆���s���܂��B,,,���]�s���}����,03-3488-4414,,���]�s���}����,���]�s�������}����,�����s���]�s�a��{��1-1-5,�s���Z���^�[�P�K,35.635125,139.578176,���c�}�����]�w���k���R��,����,,,,,,,201-0003,,0,0,0,1,1,0,0,0,0,0,0,0,,1,0,,,,,2018/12/20
132195,56,�����s,���]�s,�e�q�Ŋy���ނ��͂Ȃ���i0�E1�΁j,�I���R�f�^�m�V���I�n�i�V�J�C�i0�E1�T�C�j,,2019/1/10,2019/1/10,10:30,10:45,,�G�{�̓ǂݕ���������ׂ������s���܂�,,,���]�s���}����,03-3488-4414,,���]�s���}����,���]�s�������}����,�����s���]�s�a��{��1-1-5,�s���Z���^�[�P�K,35.635125,139.578176,���c�}�����]�w���k���R��,����,,,,,,,201-0003,,0,0,1,0,0,0,0,0,0,0,0,0,,1,0,,,,,2018/12/20
132195,57,�����s,���]�s,�e�q�Ŋy���ނ��͂Ȃ���i0�E1�΁j,�I���R�f�^�m�V���I�n�i�V�J�C�i0�E1�T�C�j,,2019/1/24,2019/1/24,10:30,10:45,,�G�{�̓ǂݕ���������ׂ������s���܂�,,,���]�s���}����,03-3488-4414,,���]�s���}����,���]�s�������}����,�����s���]�s�a��{��1-1-5,�s���Z���^�[�P�K,35.635125,139.578176,���c�}�����]�w���k���R��,����,,,,,,,201-0003,,0,0,1,0,0,0,0,0,0,0,0,0,,1,0,,,,,2018/12/20
132195,58,�����s,���]�s,�e�q�Ŋy���ނ��͂Ȃ���i2�E3�΁j,�I���R�f�^�m�V���I�n�i�V�J�C�i2�E3�T�C�j,,2019/1/10,2019/1/10,11:00,11:20,,�G�{�̓ǂݕ���������ׂ������s���܂�,,,���]�s���}����,03-3488-4414,,���]�s���}����,���]�s�������}����,�����s���]�s�a��{��1-1-5,�s���Z���^�[�P�K,35.635125,139.578176,���c�}�����]�w���k���R��,����,,,,,,,201-0003,,0,0,1,1,0,0,0,0,0,0,0,0,,1,0,,,,,2018/12/20
132195,59,�����s,���]�s,�e�q�Ŋy���ނ��͂Ȃ���i2�E3�΁j,�I���R�f�^�m�V���I�n�i�V�J�C�i2�E3�T�C�j,,2019/1/24,2019/1/24,11:00,11:20,,�G�{�̓ǂݕ���������ׂ������s���܂�,,,���]�s���}����,03-3488-4414,,���]�s���}����,���]�s�������}����,�����s���]�s�a��{��1-1-5,�s���Z���^�[�P�K,35.635125,139.578176,���c�}�����]�w���k���R��,����,,,,,,,201-0003,,0,0,1,1,0,0,0,0,0,0,0,0,,1,0,,,,,2018/12/20
132195,60,�����s,���]�s,�y�j�����͂Ȃ���,�h���E�r�I�n�i�V�J�C,,2019/1/19,2019/1/19,11:00,11:30,,�G�{�̓ǂݕ������E�܂莆���s���܂��B,,,���]�s���}����,03-3488-4414,,���]�s���}����,���]�s�������}����,�����s���]�s�a��{��1-1-5,�s���Z���^�[�P�K,35.635125,139.578176,���c�}�����]�w���k���R��,����,,,,,,,201-0003,,0,0,1,1,1,0,0,0,0,0,0,0,,1,0,,,,,2018/12/20