�ݒu��,����,�Z��,�ܓx,�o�x,�d�b�ԍ�,�A�N�Z�X���@,�{�ݖ���,�o�����܂ŕ��R�A�����Ă��Q���������̒i�����_���u���b�N�A�^�C���ڒn�Ȃǂ̔����ȉ��ʏ���,�o�����܂łɊK�i�����邪�A�肷�肪����,�o�����܂łɊK�i�����邪�A���t�g������,�o�����܂łɃX���|�v������,�{�ݓ������R�A�����Ă��Q���������̒i��,�{�ݓ��ɊK�i�����邪�A�肷�肪����,�{�ݓ��ɊK�i�����邪�A���t�g������,�{�ݓ��ɃX���|�v������,�G���x�[�^�[������,�G�X�J���[�^�[������,��Q�ґΉ����ړI�g�C��������,�I�X�g���C�g�Ή����ړI�g�C��������,�m���g�C��������,�肷��t���̗m���g�C��������,�肷��t���̏��֊�i�j���p�j������,�Ԉ֎q�ŗ��p�\�ȍX�߃X�y�[�X������,�ِ���\�ȍX�߃X�y�[�X������i�Ɨ��^�C�v�j,�{�݈ē��}������i�_���\������E�����ē��t���j,�{�ݓ��ɓ_���u���b�N������,�{�ݓ��ɓ_���ē�������,�{�ݓ��ɉ����ē�������,���ԏꂪ����,��Q�Ґ�p�X�y�[�X������,��b�Ή��ł���X�^�b�t������,�ݏo�p�̎Ԉ֎q������,��Q�҃X�|�[�c�w�����̎��i�����X�^�b�t������,�⏕���i�ӓ����E����E�������j�̓������\,�M�k�Ή����\,��Q�Ҋ������x��K�p�ł���,���l
�����s�I�����s�b�N�E�p�������s�b�N������,�����̈��,�����s�a�J���ʃ��J1-17-1,35.679396,139.711963,03-5474-2112,�s�c��]�ː��u�������Z��w�v�k��1��,���C���A���[�i,,��,��,,,��,,��,��,,��,��,,��,��,��,,,,��,,70,4,,��,,��,��,,�x�ْ�
�����s�I�����s�b�N�E�p�������s�b�N������,�����̈��,�����s�a�J���ʃ��J1-17-1,35.679396,139.711963,03-5474-2112,�s�c��]�ː��u�������Z��w�v�k��1��,�T�u�A���[�i,,,,��,,��,,��,��,,��,��,,��,��,,��,,��,��,,70,4,,��,,��,��,,�x�ْ�
�����s�I�����s�b�N�E�p�������s�b�N������,�����̈��,�����s�a�J���ʃ��J1-17-1,35.679396,139.711963,03-5474-2112,�s�c��]�ː��u�������Z��w�v�k��1��,50m�v�[��,,,,��,,��,,,��,,��,,,��,��,��,��,,,��,,70,4,,��,��,��,��,��,�x�ْ�
�����s�I�����s�b�N�E�p�������s�b�N������,�����̈��,�����s�a�J���ʃ��J1-17-1,35.679396,139.711963,03-5474-2112,�s�c��]�ː��u�������Z��w�v�k��1��,25m�v�[��,,,,��,,��,,,��,,��,,,��,��,��,��,,,��,,70,4,,��,��,��,��,��,�x�ْ�
�����s�I�����s�b�N�E�p�������s�b�N������,�����̈��,�����s�a�J���ʃ��J1-17-1,35.679396,139.711963,03-5474-2112,�s�c��]�ː��u�������Z��w�v�k��1��,���㋣�Z��,,,,��,,,,,,,,,,��,��,,,,��,,,70,4,,��,,��,��,��,�x�ْ�
�����s�I�����s�b�N�E�p�������s�b�N������,�����̈��,�����s�a�J���ʃ��J1-17-1,35.679396,139.711963,03-5474-2112,�s�c��]�ː��u�������Z��w�v�k��1��,�g���[�j���O���[��,,,,��,,��,,,��,,��,,,��,��,��,��,,,��,,70,4,,��,��,��,��,��,�x�ْ�
�����s�I�����s�b�N�E�p�������s�b�N������,�����̈��,�����s�a�J���ʃ��J1-17-1,35.679396,139.711963,03-5474-2112,�s�c��]�ː��u�������Z��w�v�k��1��,���N�̗͑��k��,,,,��,,��,,,��,,��,,,��,��,��,��,,,��,,70,4,,��,��,��,��,��,�x�ْ�
�����s�I�����s�b�N�E�p�������s�b�N������,���I�����s�b�N���������^����,�����s���c�J�������1-1,35.625574,139.663655,03-3421-6120,���}�c���s�s���u����w�w�v�k��15��,���㋣�Z��,��,,,,,,,��,,,��,��,��,,��,��,,,,,,61,2,,,��,��,��,��,�����㋣�Z��͊ϗ��ȂƑI��������ʂ�Ă���A�ϗ��҂ƑI��ŏ󋵂��قȂ�܂��B�ڍׂ͒S���܂ł��₢���킹���������B���M�k�Ή��F�ϗ����~�A�I�聁���y�����z�����s�̈�{�ݏ��{�s�K���Œ�߂�蒠�̌f���ɂ��K�p�i���Ԗ����B�j
�����s�I�����s�b�N�E�p�������s�b�N������,���I�����s�b�N���������^����,�����s���c�J�������1-1,35.625574,139.663655,03-3421-6120,���}�c���s�s���u����w�w�v�k��15��,�̈��,,��,,��,,��,,��,��,,��,,��,,��,��,,,��,,,61,2,,,,��,��,��,�M�k�Ή��F�ϗ����~�A�I�聁���y�����z�����s�̈�{�ݏ��{�s�K���Œ�߂�蒠�̌f���ɂ��K�p�i���Ԗ����B�j
�����s�I�����s�b�N�E�p�������s�b�N������,���I�����s�b�N���������^����,�����s���c�J�������1-1,35.625574,139.663655,03-3421-6120,���}�c���s�s���u����w�w�v�k��15��,��񋅋Z��,,,,,,,,,,,��,,��,,��,��,,,,,,61,2,,,,��,��,��,
�����s�I�����s�b�N�E�p�������s�b�N������,���I�����s�b�N���������^����,�����s���c�J�������1-1,35.625574,139.663655,03-3421-6120,���}�c���s�s���u����w�w�v�k��15��,�e�j�X�R�[�g,,,,,,,,,,,,,��,,,��,,,,,,61,2,,,,,��,��,�y�����z�����s�̈�{�ݏ��{�s�K���Œ�߂�蒠�̌f���ɂ��K�p�i���Ԗ����B�j
�����s�I�����s�b�N�E�p�������s�b�N������,���I�����s�b�N���������^����,�����s���c�J�������1-1,35.625574,139.663655,03-3421-6120,���}�c���s�s���u����w�w�v�k��15��,�⏕���Z��,,,,��,,��,,��,,,��,,��,,��,��,,,��,,,61,2,,,,,��,��,
�����s�I�����s�b�N�E�p�������s�b�N������,���I�����s�b�N���������^����,�����s���c�J�������1-1,35.625574,139.663655,03-3421-6120,���}�c���s�s���u����w�w�v�k��15��,��싅��,,,,,,,,,,,��,,��,,,��,,,,,,61,2,,,,,��,��,
�����s�I�����s�b�N�E�p�������s�b�N������,���I�����s�b�N���������^����,�����s���c�J�������1-1,35.625574,139.663655,03-3421-6120,���}�c���s�s���u����w�w�v�k��15��,�d���싅��,,��,,��,,,,,��,,��,��,��,,��,��,,,��,,,61,2,,,,��,��,��,
�����s�I�����s�b�N�E�p�������s�b�N������,���I�����s�b�N���������^����,�����s���c�J�������1-1,35.625574,139.663655,03-3421-6120,���}�c���s�s���u����w�w�v�k��15��,�g���[�j���O���[��,,��,,,,,,,,,��,,��,,��,��,,,,,,61,2,,,��,��,��,��,
�����s�I�����s�b�N�E�p�������s�b�N������,����������,�����s�����戻��3-20-1,35.765779,139.825792,03-5697-2111,�������g�����c���u�����w�v�k��5��,�啐����,,,,��,,��,,��,��,,��,��,��,��,��,��,,,,,,68,2,,��,,��,��,��,�y�����z�����s�̈�{�ݏ��{�s�K���Œ�߂�蒠�̌f���ɂ��A���ٗ��p�҂̒��ԗ��������B
�����s�I�����s�b�N�E�p�������s�b�N������,����������,�����s�����戻��3-20-1,35.765779,139.825792,03-5697-2111,�������g�����c���u�����w�v�k��5��,��ꕐ����,,,,��,,��,,,,,��,��,��,��,��,��,,,,,,68,2,,��,,��,��,��,�y�����z�����s�̈�{�ݏ��{�s�K���Œ�߂�蒠�̌f���ɂ��K�p�i�l���p�������{�l�Ɖ��1�l�܂ŁB���ٗ��p�҂̒��ԗ��������B�j
�����s�I�����s�b�N�E�p�������s�b�N������,����������,�����s�����戻��3-20-1,35.765779,139.825792,03-5697-2111,�������g�����c���u�����w�v�k��5��,��񕐓���,,��,,,,��,,��,,,,,��,,,��,,,,,,68,2,,��,,��,��,��,�y�����z�����s�̈�{�ݏ��{�s�K���Œ�߂�蒠�̌f���ɂ��K�p�i�l���p�������{�l�Ɖ��1�l�܂ŁB���ٗ��p�҂̒��ԗ��������B�j
�����s�I�����s�b�N�E�p�������s�b�N������,����������,�����s�����戻��3-20-1,35.765779,139.825792,03-5697-2111,�������g�����c���u�����w�v�k��5��,�|����i�ߓI�j,,,,,,,,,,,,,��,,,��,,,��,,,68,2,,��,,��,��,��,�y�����z�����s�̈�{�ݏ��{�s�K���Œ�߂�蒠�̌f���ɂ��K�p�i�l���p�������{�l�Ɖ��1�l�܂ŁB���ٗ��p�҂̒��ԗ��������B�j
�����s�I�����s�b�N�E�p�������s�b�N������,����������,�����s�����戻��3-20-1,35.765779,139.825792,03-5697-2111,�������g�����c���u�����w�v�k��5��,�|����i���I�j,,,,,,,,,,,��,,��,,��,��,,,,,,68,2,,��,,��,��,��,�y�����z�����s�̈�{�ݏ��{�s�K���Œ�߂�蒠�̌f���ɂ��K�p�i�l���p�������{�l�Ɖ��1�l�܂ŁB���ٗ��p�҂̒��ԗ��������B�j
�����s�I�����s�b�N�E�p�������s�b�N������,����������,�����s�����戻��3-20-1,35.765779,139.825792,03-5697-2111,�������g�����c���u�����w�v�k��5��,�g���[�j���O���[��,,,��,,,��,,��,��,,��,,��,��,��,��,,,,,,68,2,,��,��,��,��,��,�y�����z�����s�̈�{�ݏ��{�s�K���Œ�߂�蒠�̌f���ɂ��K�p�i�l���p�������{�l�Ɖ��1�l�܂ŁB���ٗ��p�҂̒��ԗ��������B�j
�����s�I�����s�b�N�E�p�������s�b�N������,�����C�����ې��j��,�����s�]����C��2-8-10,35.647651,139.818932,03-5569-5061,�������g���L�y�����u�C���w�v�k��10��,���C���v�[��,,��,,,,��,,��,��,,��,,��,,,��,,,,,,,,,��,��,��,,��,�y�����z�蒠��
�����s�I�����s�b�N�E�p�������s�b�N������,�����C�����ې��j��,�����s�]����C��2-8-10,35.647651,139.818932,03-5569-5061,�������g���L�y�����u�C���w�v�k��10��,�_�C�r���O�v�[��,,��,,,,��,,��,��,,��,,��,,,��,,,,,,,,,��,��,��,,��,
�����s�I�����s�b�N�E�p�������s�b�N������,�����C�����ې��j��,�����s�]����C��2-8-10,35.647651,139.818932,03-5569-5061,�������g���L�y�����u�C���w�v�k��10��,�T�u�v�[��,,��,,,,��,,��,��,,��,,��,,,��,,,,,,,,,��,��,��,,��,
�����s�I�����s�b�N�E�p�������s�b�N������,�����s��Q�ґ����X�|�[�c�Z���^�[,�����s�k��\���1-2-2,35.753929,139.724256,03-3907-5631,JR�鋞���u�\���w�v�k��10��,�̈��,��,,,,��,,,,��,,��,��,��,��,��,��,��,,��,,��,13,7,,��,��,��,��,,
�����s�I�����s�b�N�E�p�������s�b�N������,�����s��Q�ґ����X�|�[�c�Z���^�[,�����s�k��\���1-2-2,35.753929,139.724256,03-3907-5631,JR�鋞���u�\���w�v�k��10��,�g���[�j���O��,��,,,,��,,,,��,,��,��,��,��,��,��,��,,��,,��,13,7,,��,��,��,��,,
�����s�I�����s�b�N�E�p�������s�b�N������,�����s��Q�ґ����X�|�[�c�Z���^�[,�����s�k��\���1-2-2,35.753929,139.724256,03-3907-5631,JR�鋞���u�\���w�v�k��10��,�싅��,��,,,,��,,,,��,,��,��,��,��,��,��,��,,��,,��,13,7,,��,��,��,��,,
�����s�I�����s�b�N�E�p�������s�b�N������,�����s��Q�ґ����X�|�[�c�Z���^�[,�����s�k��\���1-2-2,35.753929,139.724256,03-3907-5631,JR�鋞���u�\���w�v�k��10��,�Ő��L��,��,,,,��,,,,��,,��,��,��,��,��,��,��,,��,,��,13,7,,��,��,��,��,,
�����s�I�����s�b�N�E�p�������s�b�N������,�����s������Q�҃X�|�[�c�Z���^�[,�����s�����s�x�m����2-1-1,35.686681,139.446549,042-573-3811,JR�������u�����w�v�o�X5��,�̈��,��,,,,��,,,,��,,��,��,��,,��,��,��,,��,��,��,59,14,��,��,��,��,��,,
�����s�I�����s�b�N�E�p�������s�b�N������,�����s������Q�҃X�|�[�c�Z���^�[,�����s�����s�x�m����2-1-1,35.686681,139.446549,042-573-3811,JR�������u�����w�v�o�X5��,�g���[�j���O��,��,,,,��,,,,��,,��,��,��,,��,��,��,,��,��,��,59,14,��,��,��,��,��,,
�����s�I�����s�b�N�E�p�������s�b�N������,�����s������Q�҃X�|�[�c�Z���^�[,�����s�����s�x�m����2-1-1,35.686681,139.446549,042-573-3811,JR�������u�����w�v�o�X5��,���������v�[��,��,,,,��,,,,��,,��,��,��,,��,��,��,,��,��,��,59,14,��,��,��,��,��,,
�����s�I�����s�b�N�E�p�������s�b�N������,�����s������Q�҃X�|�[�c�Z���^�[,�����s�����s�x�m����2-1-1,35.686681,139.446549,042-573-3811,JR�������u�����w�v�o�X5��,�싅��,��,,,,��,,,,��,,��,��,��,,��,��,��,,��,��,��,59,14,��,��,��,��,��,,
�����s�I�����s�b�N�E�p�������s�b�N������,�����s������Q�҃X�|�[�c�Z���^�[,�����s�����s�x�m����2-1-1,35.686681,139.446549,042-573-3811,JR�������u�����w�v�o�X5��,�T�E���h�e�[�u���e�j�X��,��,,,,��,,,,��,,��,��,��,,��,��,��,,��,��,��,59,14,��,��,��,��,��,,
�����s�I�����s�b�N�E�p�������s�b�N������,�����s������Q�҃X�|�[�c�Z���^�[,�����s�����s�x�m����2-1-1,35.686681,139.446549,042-573-3811,JR�������u�����w�v�o�X5��,���N�̗͑��k��,��,,,,��,,,,��,,��,��,��,,��,��,��,,��,��,��,59,14,��,��,��,��,��,,
�����s�I�����s�b�N�E�p�������s�b�N������,�L���e�j�X�̐X�����e�j�X�{��,�����s�����s�]����L��2-2-22,35.63467,139.788526,03-3529-3301,��񂩂����u���ۓW����w�v�k��5��,�e�j�X�R�[�g(A�R�[�g),,��,,��,��,,,,,,��,,��,,,��,,,,,,242,2,,,,��,��,��,�y�����z��Q�Ҏ蒠��񎦂���΁A���ԏꖳ��
�����s�I�����s�b�N�E�p�������s�b�N������,�L���e�j�X�̐X�����e�j�X�{��,�����s�����s�]����L��2-2-22,35.63467,139.788526,03-3529-3301,��񂩂����u���ۓW����w�v�k��5��,�e�j�X�R�[�g(B�R�[�g),,��,,��,��,,,,,,��,,��,,,��,,,,,,242,2,,,,��,��,��,�y�����z��Q�Ҏ蒠��񎦂���΁A���ԏꖳ��
�����s�I�����s�b�N�E�p�������s�b�N������,�L���e�j�X�̐X�����e�j�X�{��,�����s�����s�]����L��2-2-22,35.63467,139.788526,03-3529-3301,��񂩂����u���ۓW����w�v�k��5��,�e�j�X�R�[�g(C�R�[�g),,��,,��,��,,,,,,��,,��,,,��,,,,,,242,2,,,,��,��,��,�y�����z��Q�Ҏ蒠��񎦂���΁A���ԏꖳ��
�����s�I�����s�b�N�E�p�������s�b�N������,�L���e�j�X�̐X�����e�j�X�{��,�����s�����s�]����L��2-2-22,35.63467,139.788526,03-3529-3301,��񂩂����u���ۓW����w�v�k��5��,�e�j�X�R�[�g(C�R�[�g),,��,,��,��,,,,,,��,,��,,,��,,,,,,242,2,,,,��,��,��,�y�����z��Q�Ҏ蒠��񎦂���΁A���ԏꖳ��
�����s�I�����s�b�N�E�p�������s�b�N������,��F�C�l�������b�g�P����,�����s�]�����F3-1-1,35.630652,139.837654,03-5569-6703,JR���t���u�V�؏�w�v�o�X15��,��F���b�g�P����,,,,,,,,,,,��,��,��,,,,,,,,,,,,,,,,,
�����s�I�����s�b�N�E�p�������s�b�N������,���̑f�X�^�W�A��,�����s���z�s����376�Ԓn3,35.664235,139.527162,042-440-0555,�������u��c���w�v�k��5��,���̑f�X�^�W�A��,��,��,,��,,��,,,��,,��,��,��,��,��,��,,,��,��,��,250,8,,��,,,,,
�����s�I�����s�b�N�E�p�������s�b�N������,���̑f�X�^�W�A��,�����s���z�s����376�Ԓn3,35.664235,139.527162,042-440-0555,�������u��c���w�v�k��5��,�A�~�m�o�C�^���t�B�[���h,��,,,,,��,,,,,��,��,��,��,��,,,,,,,,,,,,,,,
�����s�I�����s�b�N�E�p�������s�b�N������,���̑f�X�^�W�A��,�����s���z�s����376�Ԓn3,35.664235,139.527162,042-440-0555,�������u��c���w�v�k��5��,���̑f�X�^�W�A�������Z��,��,,,,,,,,,,��,��,��,��,��,��,,,��,,,4,1,,,,,,,
